1,2,3,7,8-Pentachlorodibenzodioxin

Van Den Dool and Kratz RI, non-polar column, temperature ramp

Data compiled by: NIST Mass Spectrometry Data Center, William E. Wallace, director

Column type Capillary
Active phase DB-5
Column length (m) 60.
Carrier gas He
Substrate
Column diameter (mm) 0.252
Phase thickness (μm) 0.25
Tstart (C) 170.
Tend (C) 340.
Heat rate (K/min) 2.
Initial hold (min) 1.
Final hold (min)
I 2587.
ReferenceDonnelly, Munslow, et al., 1987
Comment MSDC-RI

Normal alkane RI, non-polar column, temperature ramp

Data compiled by: NIST Mass Spectrometry Data Center, William E. Wallace, director

Column type Capillary
Active phase DB-5
Column length (m) 60.
Carrier gas He
Substrate
Column diameter (mm) 0.25
Phase thickness (μm) 0.25
Tstart (C) 170.
Tend (C) 340.
Heat rate (K/min) 2.
Initial hold (min) 1.
Final hold (min)
I 2587.
ReferenceZhao and Yu, 2007
Comment MSDC-RI

References

Donnelly, Munslow, et al., 1987
Donnelly, J.R.; Munslow, W.D.; Mitchum, R.K.; Sovocool, G.W., Correlation of structure with rentention index for chlorinated dibenzo-p-dioxins, J. Chromatogr., 1987, 392, 51-63, https://doi.org/10.1016/S0021-9673(01)94253-0 . [all data]