1-Chloro-2-methylene-3,3-dimethylbicyclo[2.2.1]heptane

Gas phase ion energetics data

Data compiled as indicated in comments:
LLK - Sharon G. Lias, Rhoda D. Levin, and Sherif A. Kafafi

Ionization energy determinations

IE (eV) Method Reference Comment
9.11PENesmeyanov, Baiden, et al., 1981Vertical value; LLK

References

Nesmeyanov, Baiden, et al., 1981
Nesmeyanov, A.N.; Baiden, V.N.; Chizhov, Y.V.; Timoshenko, M.M.; Nekrasov, Y.S.; Kritskaya, I.I., He(I) photoelectron investigation of functionally substituted camphene derivatives, Dokl. Akad. Nauk SSSR, 1981, 256, 121. [all data]