9-Oxabicyclo[3.3.1]non-1-ene

Reaction thermochemistry data

Data compiled by: Hussein Y. Afeefy, Joel F. Liebman, and Stephen E. Stein

Individual Reactions

Hydrogen + 9-Oxabicyclo[3.3.1]non-1-ene = 9-Oxabicyclo[3.3.1]nonane

By formula: H2 + C8H12O = C8H14O

Quantity Value Units Method Reference Comment
Δr-154.7 ± 0.88kJ/molChydAllinger, Glaser, et al., 1981liquid phase; solvent: Hexane

Gas phase ion energetics data

Data compiled by: Sharon G. Lias, Rhoda D. Levin, and Sherif A. Kafafi

Ionization energy determinations

IE (eV) Method Reference Comment
8.60PEBatich, Heilbronner, et al., 1976Vertical value

References

Allinger, Glaser, et al., 1981
Allinger, N.L.; Glaser, J.A.; Davis, H.E., Heats of hydrogenation of some vinyl ethers and related compounds, J. Org. Chem., 1981, 46, 658-661. [all data]

Batich, Heilbronner, et al., 1976
Batich, C.; Heilbronner, E.; Quinn, C.B.; Wiseman, J.R., The electronic structure of vinyl ethers and sulfides with interrupted conjugation examined by photoelectron spectroscopy, Helv. Chim. Acta, 1976, 59, 512. [all data]