1,3-trans,5-cis-Octatriene

Normal alkane RI, polar column, temperature ramp

Data compiled by: NIST Mass Spectrometry Data Center, William E. Wallace, director

Column type Capillary
Active phase DB-Wax
Column length (m) 60.
Carrier gas He
Substrate
Column diameter (mm) 0.25
Phase thickness (μm) 1.
Tstart (C) 50.
Tend (C) 200.
Heat rate (K/min) 3.
Initial hold (min)
Final hold (min) 40.
I 1097.
ReferenceHoriuchi, Umano, et al., 1998
Comment MSDC-RI

References

Horiuchi, Umano, et al., 1998
Horiuchi, M.; Umano, K.; Shibamoto, T., Analysis of volatile compounds formed from fish oil heated with cysteine and trimethylamine oxide, J. Agric. Food Chem., 1998, 46, 12, 5232-5237, https://doi.org/10.1021/jf980482m . [all data]