Trifluoroacetic Acid, TMS derivative

Normal alkane RI, non-polar column, custom temperature program

View large format table.

Column type Active phase I Reference Comment
CapillaryPolydimethyl siloxanes674.Zenkevich, 2001Program: not specified

References

Zenkevich, 2001
Zenkevich, I.G., Encyclopedia of Chromatography. Derivatization of Hydroxy Compounds for GC Analysis, Marcel Dekker, Inc., New York - Basel, 2001, 237. [all data]