2-Methyl-3-carbomethoxyquinoxaline-1,4-dioxide
- Formula: C11H10N2O4
- Molecular weight: 234.2081
- IUPAC Standard InChIKey: SSXXUNNLZOOPGP-UHFFFAOYSA-N
- CAS Registry Number: 40016-70-4
- Chemical structure:

Gas phase thermochemistry data

Data compiled by: Hussein Y. Afeefy, Joel F. Liebman, and Stephen E. Stein
Quantity | Value | Units | Method | Reference | Comment |
---|---|---|---|---|---|
ΔfH°gas | -148.7 ± 3.2 | kJ/mol | Ccb | Acree, Powell, et al., 1997 |

Condensed phase thermochemistry data

Data compiled by: Hussein Y. Afeefy, Joel F. Liebman, and Stephen E. Stein

Quantity Value Units Method Reference Comment
Δfsolid-267.0 ± 1.9kJ/molCcbAcree, Powell, et al., 1997
Quantity Value Units Method Reference Comment
Δcsolid-5490.8 ± 1.2kJ/molCcbAcree, Powell, et al., 1997

References

Acree, Powell, et al., 1997
Acree, W.E., Jr.; Powell, J.R.; Tucker, S.A.; Ribeiro da Silva, M.D.M.C.; Matos, M.A.R.; Goncalves, J.M.; Santos, L.M.N.B.F.; Morais, V.M.F.; Pilcher, G.,
Thermochemical and theroretical study of some quinoxaline 1,4-dioxides and pyrazine 1,4-dioxide,
J. Org. Chem., 1997, 62, 3722-3726. [all data]