1-Butanesulfonamide, 1,1,2,2,3,3,4,4,4-nonafluoro-N-[(1,1,2,2,3,3,4,4,4-nonafluorobutyl)sulfonyl]-

Reaction thermochemistry data

Data compiled by: John E. Bartmess

Individual Reactions

C8F18NO4S2- + Hydrogen cation = 1-Butanesulfonamide, 1,1,2,2,3,3,4,4,4-nonafluoro-N-[(1,1,2,2,3,3,4,4,4-nonafluorobutyl)sulfonyl]-

By formula: C8F18NO4S2- + H+ = C8HF18NO4S2

Quantity Value Units Method Reference Comment
Δr284.1 ± 2.0kcal/molIMREKoppel, Taft, et al., 1994gas phase; Per Leito, Raamat, et al., 2009, dGacid is likely too weak by at least 5.3 kcal/mol, due to problems in the ladder at dGacid=293 and 299.

Gas phase ion energetics data

Data compiled by: John E. Bartmess

De-protonation reactions

C8F18NO4S2- + Hydrogen cation = 1-Butanesulfonamide, 1,1,2,2,3,3,4,4,4-nonafluoro-N-[(1,1,2,2,3,3,4,4,4-nonafluorobutyl)sulfonyl]-

By formula: C8F18NO4S2- + H+ = C8HF18NO4S2

Quantity Value Units Method Reference Comment
Δr284.1 ± 2.0kcal/molIMREKoppel, Taft, et al., 1994gas phase; Per Leito, Raamat, et al., 2009, dGacid is likely too weak by at least 5.3 kcal/mol, due to problems in the ladder at dGacid=293 and 299.

References

Koppel, Taft, et al., 1994
Koppel, I.A.; Taft, R.W.; Anvia, F.; Zhu, S.Z.; Hu, L.Q.; Sung, K.S.; Desmarteau, D.D.; Yagupolskii, L.M., The Gas-Phase Acidities of Very Strong Neutral Bronsted Acids, J. Am. Chem. Soc., 1994, 116, 7, 3047, https://doi.org/10.1021/ja00086a038 . [all data]

Leito, Raamat, et al., 2009
Leito, I.; Raamat, E.; Kutt, A.; Saame, J.; Kipper, K.; Koppel, I.A.; Koppel, I.; Zhang, M.; Mishima, M.; Yagupolskii, L.M.; Garlyauskayte, R.Y.; Filatov, A.A., Revision of the Gas-Phase Acidity Scale below 300 kcal mol(-1), J. Phys. Chem. A, 2009, 113, 29, 8421-8424, https://doi.org/10.1021/jp903780k . [all data]