Benzene, 2-ethyl-1,3,5-trimethyl-

Normal alkane RI, non-polar column, custom temperature program

Data compiled by: NIST Mass Spectrometry Data Center, William E. Wallace, director

Column type Capillary
Active phase OV-101
Column length (m) 52.
Carrier gas H2
Substrate
Column diameter (mm) 0.25
Phase thickness (μm) 0.38
Program 70 - 160 C at 1.5 deg/min; 160 - 280 C at 15 deg/min 15 min at 280 C
I 1176.
ReferenceMatisová, Juranyiová, et al., 1991
Comment MSDC-RI

References

Matisová, Juranyiová, et al., 1991
Matisová, E.; Juranyiová, E.; Kurán, P.; Brandsteterová, E.; Kocan, A.; Holotík, S., Analysis of multicomponent mixtures by high-resolution capillary gas chromatography and combined gas chromatography-mass spectrometry. I. Aromatics in a hydrocarbon matrix, J. Chromatogr., 1991, 552, 301-312, https://doi.org/10.1016/S0021-9673(01)95946-1 . [all data]