1,2-Diphenyl-1,1,2,2-tetramethoxyethane

Phase change data

Data compiled by: William E. Acree, Jr., James S. Chickos

Enthalpy of sublimation

ΔsubH (kcal/mol) Temperature (K) Method Reference Comment
18.5 ± 0.1375.TVerevkin, Dogan, et al., 1995Based on data from 351. - 399. K.

Enthalpy of fusion

ΔfusH (kcal/mol) Temperature (K) Reference
4.80328.5Verevkin, Dogan, et al., 1995

References

Verevkin, Dogan, et al., 1995
Verevkin, S.P.; Dogan, B.; Hdrich, J.; Beckhaus, H.-D.; Rchardt, C., Geminal substituent effects. VIII. Enthalpies of formation of acetals, J. Prakt. Chem., 1995, 337, 93-98. [all data]