2-methylpropan-2-[2H]ol

Phase change data

Data compiled by: Thermodynamics Research Center, NIST Boulder Laboratories, Chris Muzny director

Quantity Value Units Method Reference Comment
Tboil357.4KN/AMorton, Cala, et al., 1956Uncertainty assigned by TRC = 1. K
Quantity Value Units Method Reference Comment
Tfus300.2KN/AMorton, Cala, et al., 1956Uncertainty assigned by TRC = 0.8 K

In addition to the Thermodynamics Research Center (TRC) data available from this site, much more physical and chemical property data is available from the following TRC products:

References

Morton, Cala, et al., 1956
Morton, M.; Cala, J.A.; Piirma, I., The Branching Reaction I. Chain Transfer of Styrene with Thiol, Alcohol, and Nitrile, J. Am. Chem. Soc., 1956, 78, 5394-8. [all data]