Longipinanol

Normal alkane RI, non-polar column, custom temperature program

Data compiled by: NIST Mass Spectrometry Data Center, William E. Wallace, director

Column type CapillaryCapillaryCapillary
Active phase HP-5MSCP Sil 8 CBDB-5
Column length (m) 30.50.30.
Carrier gas HeHeHe
Substrate
Column diameter (mm) 0.250.320.25
Phase thickness (μm) 0.250.250.25
Program 40C(5min) => 2C/min => 250C(15min) => 10C/min => 270C60C(1min) => 5C/min => 160C => 5C/min => 250C(3min)60C(4min) => 6C/min => 240 => 10C/min => 280C
I 1572.1566.1566.
ReferenceFormisano C., Senatore F., et al., 2006Nivinskienë, Butkienë, et al., 2005Letchamo, Ward, et al., 2004
Comment MSDC-RI MSDC-RI MSDC-RI

Kovats' RI, non-polar column, temperature ramp

Data compiled by: NIST Mass Spectrometry Data Center, William E. Wallace, director

Column type CapillaryCapillary
Active phase DB-5DB-5
Column length (m) 30.30.
Carrier gas HeHe
Substrate
Column diameter (mm) 0.250.25
Phase thickness (μm) 0.250.25
Tstart (C) 60.60.
Tend (C) 240.240.
Heat rate (K/min) 3.3.
Initial hold (min)
Final hold (min) 30.30.
I 1550.1540.
ReferenceMarongiu, Piras, et al., 2003Marongiu, Piras, et al., 2003
Comment MSDC-RI MSDC-RI

References

Formisano C., Senatore F., et al., 2006
Formisano C.; Senatore F.; Bruno M.; Bellone G., Chemical composition and antimicrobial activity of the essential oil of Phlomis ferruginea Ten. (Lamiaceae) growing wild in Southern Italy, Flavour Fragr. J., 2006, 21, 5, 848-851, https://doi.org/10.1002/ffj.1740 . [all data]

Nivinskienë, Butkienë, et al., 2005
Nivinskienë, O.; Butkienë, R.; Mockutë, D., Chemical composition of seed (fruit) essential oils of Angelica archangelica L. growing wild in Lithuania, Chemija, 2005, 16, 3-4, 51-54. [all data]

Letchamo, Ward, et al., 2004
Letchamo, W.; Ward, W.; Heard, B.; Heard, D., Essential oil of Valeriana officinalis L. cultivars and their antimicrobial activity as influenced by harvesting time under commercial organic cultivation, J. Agric. Food Chem., 2004, 52, 12, 3915-3919, https://doi.org/10.1021/jf0353990 . [all data]