2,3,3',4,5,5'-Hexachloro-1,1'-biphenyl

Kovats' RI, non-polar column, isothermal

View large format table.

Column type Active phase Temperature (C) I Reference Comment
CapillaryOV-101150.2300.Zell, Neu, et al., 1977Column length: 27. m
CapillaryOV-101150.2301.Zell, Neu, et al., 1977Column length: 27. m

Normal alkane RI, non-polar column, temperature ramp

View large format table.

Column type Active phase I Reference Comment
CapillarySPB-12344.Nakano, Tsuji, et al., 198730. m/0.25 mm/0.25 μm, 4. K/min; Tstart: 130. C; Tend: 280. C

References

Zell, Neu, et al., 1977
Zell, M.; Neu, H.J.; Ballschmiter, K., Identifizierung der PCB-Komponenten durch retentionsindexvergleich nach kapillar-gaschromatographie, Chemosphere, 1977, 2/3, 2-3, 69-76, https://doi.org/10.1016/0045-6535(77)90047-9 . [all data]

Nakano, Tsuji, et al., 1987
Nakano, T.; Tsuji, M.; Okuno, T., Analytical methods for PCB using GC/ECD and GC/MS with capillary column, Report of the Environmental Science Institute of Hyoho Prefecture, 1987, 19, 57-62. [all data]