4H-Oxocin-5,6-dicarboxylic acid, 7-methyl-, dimethyl ester, (Z,Z,E)-

Reaction thermochemistry data

Data compiled by: Hussein Y. Afeefy, Joel F. Liebman, and Stephen E. Stein

Individual Reactions

C12H14O5 = C12H14O5

By formula: C12H14O5 = C12H14O5

Quantity Value Units Method Reference Comment
Δr18.kJ/molEqkStusche, Breuninger, et al., 1972liquid phase; solvent: CD3CN; NMR

References

Stusche, Breuninger, et al., 1972
Stusche, D.; Breuninger, M.; Prinzbach, H., σ, π-Isomerisierungen von monohetero-σ-bishomobenzenol-derivatives, Helv. Chim. Acta, 1972, 55, 2359-2365. [all data]