4-Aminobutanoic acid, 2TMS derivative

Van Den Dool and Kratz RI, non-polar column, temperature ramp

View large format table.

Column type Active phase I Reference Comment
CapillaryDB-51306.Fu, Iga, et al., 200030. m/0.25 mm/0.25 μm, He, 100. C @ 1. min, 10. K/min, 290. C @ 8. min
CapillarySE-521310.Lefevere, Verhaeghe, et al., 198925. m/0.32 mm/0.52 μm, He, 5. K/min; Tstart: 70. C; Tend: 270. C

References

Fu, Iga, et al., 2000
Fu, X.; Iga, M.; Kimura, M.; Yamaguchi, S., Simplified screening for organic acidemia using GC/MS and dried urine filter paper: a study on neonatal mass screening, Early Hum. Dev., 2000, 58, 1, 41-55, https://doi.org/10.1016/S0378-3782(00)00053-0 . [all data]

Lefevere, Verhaeghe, et al., 1989
Lefevere, M.F.; Verhaeghe, B.J.; Declerck, D.H.; Van Bocxlaer, J.F.; De Leenheer, A.P.; De Sagher, R.M., Metabolic Profiling of Urinary Organic Acids by Single and Multicolumn Capillary Gas Chromatography, J. Chromatogr. Sci., 1989, 27, 1, 23-29, https://doi.org/10.1093/chromsci/27.1.23 . [all data]