n-Amyl-n-butyl amine

Kovats' RI, non-polar column, isothermal

Data compiled by: NIST Mass Spectrometry Data Center, William E. Wallace, director

Column type Packed
Active phase Apiezon L
Column length (m) 2.7
Carrier gas N2
Substrate Chromosorb GAW
Column diameter (mm)
Phase thickness (μm)
Temperature (C) 100.
I 1046.
ReferenceGolovnya, Zhuravleva, et al., 1980
Comment MSDC-RI

References

Golovnya, Zhuravleva, et al., 1980
Golovnya, R.V.; Zhuravleva, N.L.; Svetlova, N.I.; Grigor'eva, D.N., Gas-chromatographic separation of secondary normal alphatic amines, J. Anal. Chem. USSR (Engl. Transl.), 1980, 35, 10, 1280-1285. [all data]