Spiro[4.5]dec-6-en-8-one, 1,7-dimethyl-4-(1-methylethyl)-

Kovats' RI, non-polar column, isothermal

View large format table.

Column type Active phase Temperature (C) I Reference Comment
CapillaryOV-101130.1655.Clarke, Perry, et al., 1994

Normal alkane RI, non-polar column, custom temperature program

View large format table.

Column type Active phase I Reference Comment
CapillaryHP-5MS1632.Deng, Li, et al., 200430. m/0.25 mm/0.25 μm, He; Program: 60C => 10C/min => 160C => 12C/min => 300C (5min)

References

Clarke, Perry, et al., 1994
Clarke, D.B.; Perry, N.B.; Weavers, R.T., Foliage Oil Terpenes of Prumnopitys ferruginea (D. Don) Laubenf. Variation in Acorenone Levels, J. Essnt. Oil Res., 1994, 6, 6, 549-554, https://doi.org/10.1080/10412905.1994.9699344 . [all data]

Deng, Li, et al., 2004
Deng, C.; Li, N.; Zhang, X., Rapid determination of essential oil in Acorus tatarinowii Schott. by pressurized hot water extraction followed by solid-phase microextraction and gas chromatography-mass spectrometry, J. Chromatogr. A, 2004, 1059, 1-2, 149-155, https://doi.org/10.1016/j.chroma.2004.10.005 . [all data]