trans-1,3-octadiene

Gas phase ion energetics data

Data compiled as indicated in comments:
LLK - Sharon G. Lias, Rhoda D. Levin, and Sherif A. Kafafi

Ionization energy determinations

IE (eV) Method Reference Comment
8.45PEMasclet, Mouvier, et al., 1981LLK

Kovats' RI, non-polar column, isothermal

View large format table.

Column type Active phase Temperature (C) I Reference Comment
CapillarySqualane70.810.5Soják, Král'ovicová, et al., 1984195. m/0.25 mm/0.08 μm, H2
CapillarySqualane70.815.4Soják, Ostrovský, et al., 1980N2; Column length: 200. m; Column diameter: 0.25 mm
CapillarySqualane70.811.1Soják, Ostrovský, et al., 1980N2; Column length: 70. m; Column diameter: 0.25 mm
CapillarySqualane50.809.3Welsch, Engewald, et al., 1978Column length: 80. m; Column diameter: 0.23 mm
CapillarySqualane30.809.Döring, Estel, et al., 1974Column length: 150. m; Column diameter: 0.25 mm

Normal alkane RI, polar column, temperature ramp

View large format table.

Column type Active phase I Reference Comment
CapillaryDB-Wax955.Horiuchi, Umano, et al., 199860. m/0.25 mm/1. μm, He, 3. K/min, 200. C @ 40. min; Tstart: 50. C

References

Masclet, Mouvier, et al., 1981
Masclet, P.; Mouvier, G.; Bocquet, J.F., Effets electroniques et effets steriques dus a la substitution alcoyle dans les dienes conjugues, J. Chim. Phys., 1981, 78, 99. [all data]

Soják, Král'ovicová, et al., 1984
Soják, L.; Král'ovicová, E.; Ostrovský, I.; Leclercq, P.A., Retention behaviour of conjegated and isolated n-alkadienes. Identification of n-nona- and n-decadiens by capillary gas chromatography using structure-retention correlations and mass spectrometry, J. Chromatogr., 1984, 292, 1, 241-261, https://doi.org/10.1016/S0021-9673(01)96207-7 . [all data]

Soják, Ostrovský, et al., 1980
Soják, L.; Ostrovský, I.; Leclercq, P.A.; Rijks, J.A., Identification of n-hepta- and n-octadienes by high-resolution gas chromatography using structure-retention correlations and mass spectrometry, J. Chromatogr., 1980, 191, 187-198, https://doi.org/10.1016/S0021-9673(00)86379-7 . [all data]

Welsch, Engewald, et al., 1978
Welsch, Th.; Engewald, W.; Berger, P., IX. Das gas-chromatographische Retentionsverhalten isomerer Octine and Octadiine, Chromatographia, 1978, 11, 1, 5-9, https://doi.org/10.1007/BF02262945 . [all data]

Döring, Estel, et al., 1974
Döring, C.-E.; Estel, D.; Geyer, R.; Wendt, W.-H., Kapillargaschromatographische Analyse geradkettiger C8-Diene, Z. Chem., 1974, 14, 7, 292-293, https://doi.org/10.1002/zfch.19740140730 . [all data]

Horiuchi, Umano, et al., 1998
Horiuchi, M.; Umano, K.; Shibamoto, T., Analysis of volatile compounds formed from fish oil heated with cysteine and trimethylamine oxide, J. Agric. Food Chem., 1998, 46, 12, 5232-5237, https://doi.org/10.1021/jf980482m . [all data]