Biferrocenium triiodide

Condensed phase thermochemistry data

Data compiled by: Eugene S. Domalski and Elizabeth D. Hearing

Constant pressure heat capacity of solid

Cp,solid (cal/mol*K) Temperature (K) Reference Comment
110.83300.Sorai, Nishimori, et al., 1987T = 14 to 360 K. Interpolated data.

References

Sorai, Nishimori, et al., 1987
Sorai, M.; Nishimori, A.; Hendrickson, D.N.; Dong, T.Y.; Cohn, M.J., Heat capacity and phase transition of the mixed-valence compound biferrocenium triiodide, J. Am. Chem. Soc., 1987, 109, 4266-4275. [all data]