Benzoic acid, 4-hydroxy-3-methoxy-, methyl ester

Normal alkane RI, polar column, custom temperature program

Data compiled by: NIST Mass Spectrometry Data Center, William E. Wallace, director

Column type CapillaryCapillaryCapillaryCapillaryCapillary
Active phase DB-WaxSupelcowax-10DB-Wax EtrDB-WaxCP-Wax 52 CB
Column length (m) 60.30.60.60.30.
Carrier gas HeliumHeliumHeH2H2
Substrate
Column diameter (mm) 0.250.250.250.320.32
Phase thickness (μm) 0.500.250.50.5
Program 40 0C (3 min) 10 0C/min -> 90 0C 2 0C/min -> 230 0C (37 min)45 0C 3 0C/min -> 230 0C (10 min) 10 0C/min -> 270 0C (21 min)40C(3min) => 10C/min => 90C => 2C/min => 230C (37min)40C(2min) => 6C/min => 200C (15min) => 220C (20min)60 0C 2 0C/min -> 220 0C 3 0C/min -> 245 0C
I 2629.2565.2629.2613.2635.
ReferenceLoscos, Hernandez-Orte, et al., 2009de Simon, Estruelas, et al., 2009Loskos, Hernandez-Orte, et al., 2007Ferreira, Pet'ka, et al., 2006Carro Marino, López Tamames, et al., 1995
Comment MSDC-RI MSDC-RI MSDC-RI MSDC-RI MSDC-RI
Column type CapillaryCapillary
Active phase Supelcowax-10Supelcowax-10
Column length (m) 30.30.
Carrier gas
Substrate
Column diameter (mm) 0.530.53
Phase thickness (μm) 0.250.25
Program 80C(5min) => 5C/min => 155C => 4C/min => 240C(30min)80C(5min) => 5C/min => 155C => 4C/min => 240C(30min)
I 2598.2603.
ReferenceMiranda-Lopez, Libbey, et al., 1992Miranda-Lopez, Libbey, et al., 1992
Comment MSDC-RI MSDC-RI

Normal alkane RI, non-polar column, temperature ramp

Data compiled by: NIST Mass Spectrometry Data Center, William E. Wallace, director

Column type CapillaryCapillaryCapillary
Active phase HP-5 MSZB-5DB-5
Column length (m) 30.30.30.
Carrier gas HeliumHeliumHe
Substrate
Column diameter (mm) 0.250.250.25
Phase thickness (μm) 0.250.250.25
Tstart (C) 70.40.40.
Tend (C) 200.280.250.
Heat rate (K/min) 3.6.2.
Initial hold (min) 2.1.
Final hold (min) 18.9.
I 1527.1526.1516.
ReferenceJerkovic, Hegic, et al., 2010Harrison and Priest, 2009Güntert, Rapp, et al., 1986
Comment MSDC-RI MSDC-RI MSDC-RI

Van Den Dool and Kratz RI, non-polar column, temperature ramp

Data compiled by: NIST Mass Spectrometry Data Center, William E. Wallace, director

Column type CapillaryCapillaryCapillaryCapillary
Active phase HP-5DB-5DB-5DB-5
Column length (m) 60.30.30.30.
Carrier gas HeH2N2H2
Substrate
Column diameter (mm) 0.250.250.320.25
Phase thickness (μm) 0.250.251.0.25
Tstart (C) 60.35.40.50.
Tend (C) 250.270.230.290.
Heat rate (K/min) 3.5.4.4.
Initial hold (min)   2.
Final hold (min)  20.10.
I 1525.1525.1496.1526.
ReferencePerraudin, Popovici, et al., 2006Alves, Pinto, et al., 2005Fang and Qian, 2005da Silva, Borba, et al., 1999
Comment MSDC-RI MSDC-RI MSDC-RI MSDC-RI

Van Den Dool and Kratz RI, polar column, custom temperature program

Data compiled by: NIST Mass Spectrometry Data Center, William E. Wallace, director

Column type CapillaryCapillary
Active phase DB-WaxCarbowax 20M
Column length (m) 30.25.
Carrier gas H2H2
Substrate
Column diameter (mm) 0.320.32
Phase thickness (μm) 0.50.25
Program 60C(3min) => 2C/min => 220C => 3C/min => 245C (20min)40C (8min) => 3C/min => 180C => 20C/min => 230C
I 2600.2586.
ReferenceSelli, Cabaroglu, et al., 2004Boido, Lloret, et al., 2003
Comment MSDC-RI MSDC-RI

References

Loscos, Hernandez-Orte, et al., 2009
Loscos, N.; Hernandez-Orte, P.; Cacho, J.; Ferreira, V., Fate of grape flavor precursors during storage on yeast lees, J. Agric. Food Chem., 2009, 57, 12, 5468-5479, https://doi.org/10.1021/jf804057q . [all data]

de Simon, Estruelas, et al., 2009
de Simon, B.F.; Estruelas, E.; Munoz, A.M.; Cadahia, E.; Sanz, M., Volatile compounds in acacia, chestnut, cherry, ash, and oak woods, with a view to their use in cooperage, J. Agric. Food Chem., 2009, 57, 8, 3217-3227, https://doi.org/10.1021/jf803463h . [all data]

Loskos, Hernandez-Orte, et al., 2007
Loskos, N.; Hernandez-Orte, P.; Cacho, J.; Ferreira, V., Release and formation of varietal aroma compounds during alcoholic fermentation from nonfloral grape odorless flavor precursors fractions, J. Agric. Food Chem., 2007, 55, 16, 6674-6684, https://doi.org/10.1021/jf0702343 . [all data]

Ferreira, Pet'ka, et al., 2006
Ferreira, V.; Pet'ka, J.; Cacho, J., Intensity and persistence profiles of flavor compounds in synthetic solutions. Simple model for explaining the intensity and persistence of their aftersmell, J. Agric. Food Chem., 2006, 54, 2, 489-496, https://doi.org/10.1021/jf051802m . [all data]

Carro Marino, López Tamames, et al., 1995
Carro Marino, N.; López Tamames, E.; García Jares, C.M., Contribution to the study of the aromatic potential of three muscat Vitis vinifera varieties: identification of new compounds, Food Sci. Technol. Int., 1995, 1, 2-3, 105-116, https://doi.org/10.1177/108201329500100206 . [all data]

Miranda-Lopez, Libbey, et al., 1992
Miranda-Lopez, R.; Libbey, L.M.; Watson, B.T.; McDaniel, M.R., Odor analysis of Pinot noir wines from grapes of different maturities by a gas chromatography-olfactometry technique (Osme), J. Food Sci., 1992, 57, 4, 985-993, https://doi.org/10.1111/j.1365-2621.1992.tb14339.x . [all data]