Tetra(methylthia)silane

Phase change data

Data compiled by: William E. Acree, Jr., James S. Chickos

Enthalpy of fusion

ΔfusH (kJ/mol) Temperature (K) Method Reference
2.18304.5DSCFuess, Strauss, et al., 1998

References

Fuess, Strauss, et al., 1998
Fuess, Hartmut; Strauss, Roman; Kimura, Keisuke; Sorai, Michio, Order-Disorder Phase Transitions in Tetrathioorthoesters of Group IV Elements X(SCH 3 ) 4 , X = C, Si, Ge, Sn, J. Phys. Chem. B, 1998, 102, 27, 5329-5334, https://doi.org/10.1021/jp973310l . [all data]