Potassium heptamer

Gas phase ion energetics data

Data compiled as indicated in comments:
LBLHLM - Sharon G. Lias, John E. Bartmess, Joel F. Liebman, John L. Holmes, Rhoda D. Levin, and W. Gary Mallard
LLK - Sharon G. Lias, Rhoda D. Levin, and Sherif A. Kafafi
B - John E. Bartmess

Electron affinity determinations

EA (eV) Method Reference Comment
1.05 ± 0.10LPESMcHugh, Eaton, et al., 1989Vertical Detachment Energy: 1.140±0.020 eV; B

Ionization energy determinations

IE (eV) Method Reference Comment
3.40 ± 0.10PIKappes, Radi, et al., 1985LBLHLM
3.3 ± 0.1PIHerrmann, Leutwyler, et al., 1978LLK

References

McHugh, Eaton, et al., 1989
McHugh, K.M.; Eaton, J.G.; Lee, G.H.; Sarkas, H.W.; Kidder, L.H.; Snodgrass, J.T.; Manaa, M.R.; Bowen, K.H., Photoelectron Spectra of the alkali metal cluster Anions: Na-,n=2-5, K-,n=2-7, Rb-,n=2-3, and Cs-,n=2-3, J. Chem. Phys., 1989, 91, 6, 3792, https://doi.org/10.1063/1.456861 . [all data]

Kappes, Radi, et al., 1985
Kappes, M.M.; Radi, P.; Schar, M.; Schumacher, E., Probes for electronic and geometrical shell structure effects in alkali-metal clusters. Photoionization measurements on KxLi, KxMg and KxZn(x<25), Chem. Phys. Lett., 1985, 119, 11. [all data]

Herrmann, Leutwyler, et al., 1978
Herrmann, A.; Leutwyler, S.; Schumacher, E.; Woste, L., 38. On metal-atom clusters IV. Photoionization thresholds and multiphoton ionization spectra of alkali-metal molecules, Helv. Chim. Acta, 1978, 61, 453. [all data]