Benzene, 1-bromo-2-(trifluoromethyl)-

Phase change data

Data compiled by: Robert L. Brown and Stephen E. Stein

Quantity Value Units Method Reference Comment
Tboil440. - 441.KN/AFarchan Laboratories, 1990
Tboil440. - 441.KN/APCR Inc., 1990
Tboil440.7KN/AWeast and Grasselli, 1989

Gas phase ion energetics data

Data compiled by: Sharon G. Lias, Rhoda D. Levin, and Sherif A. Kafafi

Ionization energy determinations

IE (eV) Method Reference Comment
9.38PEGounelle, Jullien, et al., 1975Vertical value

References

Farchan Laboratories, 1990
Farchan Laboratories, Research Chemicals Catalog, Farchan Laboratories, Gainesville, FL, 1990, 91. [all data]

PCR Inc., 1990
PCR Inc., Research Chemicals Catalog 1990-1991, PCR Inc., Gainesville, FL, 1990, 1. [all data]

Weast and Grasselli, 1989
CRC Handbook of Data on Organic Compounds, 2nd Editon, Weast,R.C and Grasselli, J.G., ed(s)., CRC Press, Inc., Boca Raton, FL, 1989, 1. [all data]