ω-perfluorodecyl-1-butanol

Phase change data

Data compiled by: Thermodynamics Research Center, NIST Boulder Laboratories, Chris Muzny director

Quantity Value Units Method Reference Comment
Tfus360.KN/AHopken, Moller, et al., 1991Uncertainty assigned by TRC = 0.1 K

In addition to the Thermodynamics Research Center (TRC) data available from this site, much more physical and chemical property data is available from the following TRC products:

References

Hopken, Moller, et al., 1991
Hopken, J.; Moller, M.; Boileau, S., Self-organization of amphiphilic fluorocarbon-hydrocarbon molecules.  I.  Synthesis and interfacial activity of allyl ethers, New Polymeric Mater., 1991, 2, 4, 339. [all data]