2(3H)-Furanone, 5-butyldihydro-4-methyl-

Normal alkane RI, non-polar column, custom temperature program

Data compiled by: NIST Mass Spectrometry Data Center, William E. Wallace, director

Column type CapillaryCapillaryCapillaryCapillaryCapillary
Active phase Polydimethyl siloxane with 5 % Ph groupsPolydimethyl siloxane with 5 % Ph groupsCP-Sil 5 CBCP Sil 5 CBSE-30
Column length (m)   50.50.
Carrier gas   NitrogenHe
Substrate
Column diameter (mm)   0.320.32
Phase thickness (μm)   1.201.2
Program not specifiednot specified36 0C 20 0C/min -> 85 0C 1 0C -> 145 0C 3 0C/min -> 250 0C36C => 20C/min => 85C => 1C/min => 145C => 3C/min => 250Cnot specified
I 1299.1304.1281.1281.1240.
ReferenceRobinson, Adams, et al., 2012Robinson, Adams, et al., 2012Bailly, Jerkovic, et al., 2009Bailly, Jerkovic, et al., 2006Vinogradov, 2004
Comment MSDC-RI MSDC-RI MSDC-RI MSDC-RI MSDC-RI

Normal alkane RI, polar column, custom temperature program

Data compiled by: NIST Mass Spectrometry Data Center, William E. Wallace, director

Column type Capillary
Active phase FFAP
Column length (m) 25.
Carrier gas Nitrogen
Substrate
Column diameter (mm) 0.32
Phase thickness (μm) 0.30
Program 36 0C 20 0C/min -> 85 0C 1 0C -> 145 0C 3 0C/min -> 230 0C
I 1968.
ReferenceBailly, Jerkovic, et al., 2009
Comment MSDC-RI

References

Robinson, Adams, et al., 2012
Robinson, A.L.; Adams, D.O.; Boss, P.K.; Heymann, H.; Solomon, P.S.; Trengove, R.D., Influence of geographic origine on the sensory characteristics and wine composition of Vitus viniferas cv. Cabernet Sauvignon wines from Australia (Supplemental data), Am. J. Enol. Vitic., 2012, 64, 4, 467-476, https://doi.org/10.5344/ajev.2012.12023 . [all data]

Bailly, Jerkovic, et al., 2009
Bailly, S.; Jerkovic, V.; Meuree, A.; Timmermans, A.; Collin, S., Fate of key odorants in Sauternes wines through aging, J. Agric. Food Chem., 2009, 57, 18, 8557-8563, https://doi.org/10.1021/jf901429d . [all data]

Bailly, Jerkovic, et al., 2006
Bailly, S.; Jerkovic, V.; Marchand-Brynaert, J.; Collin, S., Aroma Extraction Dilution Analysis of Sauternes Wines. Key Role of Polyfunctional Thiols, J. Agric. Food Chem., 2006, 54, 19, 7227-7234, https://doi.org/10.1021/jf060814k . [all data]

Vinogradov, 2004
Vinogradov, B.A., Production, composition, properties and application of essential oils, 2004, retrieved from http://viness.narod.ru. [all data]