Aluminate(1-), tetrafluoro-, cesium

Gas phase ion energetics data

Data compiled by: Sharon G. Lias, Rhoda D. Levin, and Sherif A. Kafafi

Ionization energy determinations

IE (eV) Method Reference Comment
13.12 ± 0.05PELassiter, Allen, et al., 1980Vertical value

References

Lassiter, Allen, et al., 1980
Lassiter, T.W.; Allen, J.D., Jr.; Schweitzer, G.K., The photoelectron spectroscopic characterization of vapors above heated alkali tetrafluoroaluminates, alkali tetrachloroaluminates, ammonium tetrachloroaluminate, J. Electron Spectrosc. Relat. Phenom., 1980, 19, 321. [all data]