1-Hexacosanol, TMS derivative

Van Den Dool and Kratz RI, non-polar column, temperature ramp

View large format table.

Column type Active phase I Reference Comment
CapillaryOV-52950.García, Sáenz, et al., 199725. m/0.25 mm/0.23 μm, He, 230. C @ 6. min, 4. K/min; Tend: 300. C

Van Den Dool and Kratz RI, non-polar column, custom temperature program

View large format table.

Column type Active phase I Reference Comment
CapillaryVF-5MS2935.6Zheng and White, 200830. m/0.25 mm/0.25 μm, He; Program: not specified

Normal alkane RI, non-polar column, temperature ramp

View large format table.

Column type Active phase I Reference Comment
CapillaryRTX-5 Sil MS2945.Lytovchenko, Beleggia, et al., 200930. m/0.25 mm/0.25 μm, Helium, 70. C @ 5. min, 5. K/min, 310. C @ 1. min

References

García, Sáenz, et al., 1997
García, M.D.; Sáenz, M.T.; Ahumada, M.D.; Cert, A., Isolation of three triterpenes and several aliphatic alcohols from Crataegus monogyna Jacq., J. Chromatogr. A, 1997, 767, 1-2, 340-342, https://doi.org/10.1016/S0021-9673(96)01091-6 . [all data]

Zheng and White, 2008
Zheng, Y.; White, E., Retention Data. NIST Mass Spectrometry Data Center., NIST Mass Spectrometry Data Center, 2008. [all data]

Lytovchenko, Beleggia, et al., 2009
Lytovchenko, A.; Beleggia, R.; Schauer, N.; Isaacson, T.; Leuendorf, J.E.; Hellmann, H.; Rose, J.K.C.; Fernie, A.R., Application of GC-MS fpr the detection of lipophilic compounds in diverse plant tissues, Plant Methods, 2009, 5, 4, 1-11. [all data]