2-Decenal, (E)-

Normal alkane RI, polar column, custom temperature program

Data compiled by: NIST Mass Spectrometry Data Center, William E. Wallace, director

Column type CapillaryCapillaryCapillaryCapillaryCapillary
Active phase CP-Wax 52 CBAquaWaxSupelcowax-10Innowax FSCInnowax FSC
Column length (m) 60. 30.60.60.
Carrier gas Helium HeHeHe
Substrate
Column diameter (mm) 0.25 0.250.250.25
Phase thickness (μm) 0.25 0.250.250.25
Program 45 0C (5 min) 3 0C/min -> 150 0C 10 0C/min -> 240 0Cnot specified40C(3min) => 4C/min => 75C => 8C/min => 250C(5min)60C(10min) => 4C/min => 220C (10min) => 1C/min => 240C60C(10min) => 4C/min >220C (10min) => 1C/min => 240C
I 1647.1630.1657.1661.1664.
ReferenceRomeo, Verzera, et al., 2009Liolios, Laouer, et al., 2007Vichi, Guadayol, et al., 2007Baser K.H.C., Ozek G., et al., 2006Baser, Özek, et al., 2006
Comment MSDC-RI MSDC-RI MSDC-RI MSDC-RI MSDC-RI
Column type CapillaryCapillaryCapillaryCapillaryCapillary
Active phase HP-Innowax FSCInnowax FSCHP-Innowax FSCHP Innowax FSPCarbowax 20M
Column length (m) 60.60.60.60.
Carrier gas  HeHeN2
Substrate
Column diameter (mm) 0.250.250.250.25
Phase thickness (μm) 0.250.250.250.25
Program 60C(10min) => 4C/min => 220C (10min) => 1C/min => 240C60C(10min) => 4C/min => 220C(10min) => 1C/min => 240C60C(10min) => 4C/min => 220C(10min) => 1C/min => 240C60C(10min) => 4C/min => 220C(10min) => 1C/min => 240Cnot specified
I 1655.1655.1655.1655.1640.
ReferenceTabanca, Demirci, et al., 2006Kosar, Özek, et al., 2005Sezik E., Kocakulak E., et al., 2005Altintas, Kose, et al., 2004Vinogradov, 2004
Comment MSDC-RI MSDC-RI MSDC-RI MSDC-RI MSDC-RI
Column type CapillaryCapillaryCapillaryCapillaryCapillary
Active phase DB-FFAPHP-Innowax FSCInnowaxInnowaxInnowax
Column length (m) 30.60.60.60.60.
Carrier gas H2HeHeHeHe
Substrate
Column diameter (mm) 0.30.250.250.250.25
Phase thickness (μm) 0.250.250.250.250.25
Program 35C (1min) => 40C/min => 60C (5min) => 4C/min => 220C60C(10min) => 4C/min => 220C(10min) => 1C/min => 240C60C(10min) => 4C/min => 200C(10min) => 1C/min => 240C60 0C (10 min) 4 K/min -> 220 0C (10 min) 1 K/min -> 240 0C60 0C (10 min) 4 K/min -> 220 0C (10 min) 1 K/min -> 240 0C
I 1641.1655.1655.1655.1658.
ReferenceTriqui and Bouchriti, 2003Kivcak B., Mert T., et al., 2001Özcan, Akgül, et al., 2001Baser, Özek, et al., 2000Baser, Tabanca, et al., 2000
Comment MSDC-RI MSDC-RI MSDC-RI MSDC-RI MSDC-RI
Column type CapillaryCapillaryCapillaryCapillaryCapillary
Active phase Innowax FSCFFAPFFAPFFAPCP Wax 52 CB
Column length (m) 60.30.30.30.50.
Carrier gas HeHeHeHe
Substrate
Column diameter (mm) 0.250.320.320.320.32
Phase thickness (μm) 0.250.250.250.250.20
Program 60C(10 min) => 4C/min => 220C(10min) => 1C/min => 240C35C(1min) => 40C/min => 60C (1min) => 6C/min => 230C35C (2min) => 40C/min => 60C (2min) => 6C/min => 180C => 10C/min => 240C35C (2min) => 40C/min => 60C (2min) => 6C/min => 180C => 10C/min => 240C50 0C (10 min) 2 0C/min -> 100 0C 5 0C/min -> 150 0C 7 0C/min -> 220 0C (20 min)
I 1655.1615.1647.1640.1632.
ReferenceKirimer, Tabanca, et al., 2000Matsui, Guth, et al., 1998Schermann and Schieberle, 1997Schermann and Schieberle, 1997Patterson and Stevenson, 1995
Comment MSDC-RI MSDC-RI MSDC-RI MSDC-RI MSDC-RI

Kovats' RI, polar column, temperature ramp

Data compiled by: NIST Mass Spectrometry Data Center, William E. Wallace, director

Column type CapillaryCapillaryCapillary
Active phase DB-WaxDB-WaxCarbowax 20M
Column length (m) 30.60.150.
Carrier gas H2He
Substrate
Column diameter (mm)  0.250.64
Phase thickness (μm)
Tstart (C) 50.40.50.
Tend (C) 260.200.170.
Heat rate (K/min) 5.2.1.
Initial hold (min)  10.30.
Final hold (min)
I 1643.1642.1630.
ReferenceSmallfield, Perry, et al., 1994Umano and Shibamoto, 1987Buttery, Ling, et al., 1982
Comment MSDC-RI MSDC-RI MSDC-RI

Normal alkane RI, polar column, temperature ramp

Data compiled by: NIST Mass Spectrometry Data Center, William E. Wallace, director

Column type CapillaryCapillaryCapillaryCapillaryCapillary
Active phase DB-WaxDB-WaxStabilwaxHP-FFAPInnowax
Column length (m) 30.30.30.30.50.
Carrier gas HeliumHeliumHeliumHeliumHe
Substrate
Column diameter (mm) 0.320.320.250.250.2
Phase thickness (μm) 0.250.250.500.250.5
Tstart (C) 40.40.35.40.60.
Tend (C) 230.230.225.120.250.
Heat rate (K/min) 6.6.6.3.2.
Initial hold (min) 2.2.5.3.
Final hold (min) 20.20.10.5.60.
I 1644.1647.1641.1660.1628.
ReferenceChen, Song, et al., 2009Chen, Song, et al., 2009Watcharananun, Cadwallader, et al., 2009Guzman-Geronimo, Lopez, et al., 2008Bendimerad and Bendiab, 2005
Comment MSDC-RI MSDC-RI MSDC-RI MSDC-RI MSDC-RI
Column type CapillaryCapillaryCapillaryCapillaryCapillary
Active phase Supelcowax-10Supelcowax-10Supelcowax-10BP-20DB-Wax
Column length (m) 60.60.60.50.60.
Carrier gas HeHeHe N2
Substrate
Column diameter (mm) 0.530.530.530.220.25
Phase thickness (μm) 1.1.1.0.250.25
Tstart (C) 40.40.40.60.70.
Tend (C) 240.240.240.220.230.
Heat rate (K/min) 4.4.4.2.2.
Initial hold (min) 2.2.2. 2.
Final hold (min) 20.20.20.20.20.
I 1673.1674.1682.1634.1645.
ReferenceRochat and Chaintreau, 2005Rochat and Chaintreau, 2005Rochat and Chaintreau, 2005Blanc, Muselli, et al., 2004Choi, 2004
Comment MSDC-RI MSDC-RI MSDC-RI MSDC-RI MSDC-RI
Column type CapillaryCapillaryCapillaryCapillaryCapillary
Active phase DB-WaxDB-WaxHP-FFAPSupelcowax-10Supelcowax-10
Column length (m) 60.60.30.30.30.
Carrier gas N2HeHeHeHe
Substrate
Column diameter (mm) 0.250.250.250.250.25
Phase thickness (μm) 0.250.250.250.250.25
Tstart (C) 70.40.40.40.40.
Tend (C) 230.220.120.200.200.
Heat rate (K/min) 2.3.5.3.3.
Initial hold (min) 2.5.5.10.10.
Final hold (min) 20. 3.
I 1615.1646.1660.1641.1641.
ReferenceChoi, 2004, 2López, Ezpeleta, et al., 2004López, Guzmán, et al., 2004Vichi, Castellote, et al., 2003Vichi, Pizzale, et al., 2003
Comment MSDC-RI MSDC-RI MSDC-RI MSDC-RI MSDC-RI
Column type CapillaryCapillaryCapillaryCapillaryCapillary
Active phase DB-WaxDB-WaxDB-WaxDB-WaxDB-Wax
Column length (m) 30.60.60.30.60.
Carrier gas HeN2HeHe
Substrate
Column diameter (mm) 0.320.250.250.530.32
Phase thickness (μm) 0.50.250.251.0.25
Tstart (C) 40.70.40.40.50.
Tend (C) 240.230.200.225.210.
Heat rate (K/min) 7.2.2.6.1.5
Initial hold (min)   2.5.5.
Final hold (min) 5.  30.10.
I 1655.1651.1629.1641.1645.
ReferenceLin, Rouseff, et al., 2002Tu, Thanh, et al., 2002Umano, Hagi, et al., 2002Cadwallader and Heo, 2001Chyau and Mau, 2001
Comment MSDC-RI MSDC-RI MSDC-RI MSDC-RI MSDC-RI
Column type CapillaryCapillaryCapillaryCapillaryCapillary
Active phase DB-WaxInnowaxDB-WaxCarbowax 20MHP-Innowax FSC
Column length (m) 30.60.60.50.60.
Carrier gas HeHe HeHe
Substrate
Column diameter (mm) 0.250.250.250.250.25
Phase thickness (μm) 0.250.25 0.250.25
Tstart (C) 50.60.30.35.60.
Tend (C) 180.220.170.230.220.
Heat rate (K/min) 3. 2.3.4.
Initial hold (min)  10.4. 10.
Final hold (min) 40. 30.30.10.
I 1597.1655.1641.1613.1655.
ReferenceLee and Shibamoto, 2000Kaya, Baser, et al., 1999Buttery and Ling, 1998Chatonnet and Dubourdieu, 1998Tümen, Baser, et al., 1998
Comment MSDC-RI MSDC-RI MSDC-RI MSDC-RI MSDC-RI
Column type CapillaryCapillaryCapillaryCapillaryCapillary
Active phase DB-WaxTC-WaxDB-WaxDB-WaxDB-Wax
Column length (m) 60.60.60.60.60.
Carrier gas H2 HeHe
Substrate
Column diameter (mm) 0.320.250.250.250.25
Phase thickness (μm) 0.25
Tstart (C) 60.80.60.60.60.
Tend (C) 220.240.180.180.220.
Heat rate (K/min) 3.3.2.2.3.
Initial hold (min)  5.4.4.4.
Final hold (min)
I 1636.1648.1633.1637.1660.
ReferenceWerkhoff, Güntert, et al., 1998Shuichi, Masazumi, et al., 1996Kobayashi, Tsuda, et al., 1995Kobayashi, Tsuda, et al., 1995Chung, Eiserich, et al., 1993
Comment MSDC-RI MSDC-RI MSDC-RI MSDC-RI MSDC-RI
Column type CapillaryCapillaryCapillaryCapillaryCapillary
Active phase Carbowax 20MCarbowax 20MCarbowax 20MCarbowax 20MCarbowax 20M
Column length (m) 50.50.150.150.150.
Carrier gas HeHe
Substrate
Column diameter (mm) 0.250.250.640.640.64
Phase thickness (μm)
Tstart (C) 60.60.50.50.50.
Tend (C) 180.180.170.170.170.
Heat rate (K/min) 2.2.1.1.1.
Initial hold (min) 4.4.30.30.30.
Final hold (min)
I 1596.1596.1630.1630.1640.
ReferenceKawakami, Kobayashi, et al., 1993Kawakami and Kobayashi, 1991Buttery, Parker, et al., 1981Buttery and Kamm, 1980Buttery, Ling, et al., 1980
Comment MSDC-RI MSDC-RI MSDC-RI MSDC-RI MSDC-RI

Van Den Dool and Kratz RI, polar column, temperature ramp

Data compiled by: NIST Mass Spectrometry Data Center, William E. Wallace, director

Column type CapillaryCapillaryCapillaryCapillaryCapillary
Active phase DB-WaxDB-WaxRTX-WaxDB-WaxHP-Wax
Column length (m) 30.60.60.60.30.
Carrier gas HeHeHeHeN2
Substrate
Column diameter (mm) 0.250.250.220.250.25
Phase thickness (μm) 0.250.250.250.250.25
Tstart (C) 40.40.60.40.60.
Tend (C) 200.200.230.200.220.
Heat rate (K/min) 4.4.2.4.5.
Initial hold (min) 1.1. 1.10.
Final hold (min) 10.10.35.10.
I 1630.1630.1640.1630.1592.
ReferenceCho, Namgung, et al., 2008Cho I.H., Lee S.M., et al., 2007Paolini, Muselli, et al., 2007Cho, Kim, et al., 2006Flamini, Tebano, et al., 2006
Comment MSDC-RI MSDC-RI MSDC-RI MSDC-RI MSDC-RI
Column type CapillaryCapillaryCapillaryCapillaryCapillary
Active phase CP-Wax 52CBBP-20Supelcowax-10DB-WaxInnowax
Column length (m) 60.50.30.0.15.
Carrier gas  HeHe He
Substrate
Column diameter (mm) 0.250.220.250.320.25
Phase thickness (μm) 0.250.250.250.50.25
Tstart (C) 35.60.60.40.35.
Tend (C) 203.220.240.240.225.
Heat rate (K/min) 3.2.3.7.4.
Initial hold (min) 4. 5. 5.
Final hold (min)  20.10.5.20.
I 1640.1642.1638.1656.1647.
ReferenceAlasalvar, Taylor, et al., 2005Ferrari, Tomi, et al., 2005Riu-Aumatell, Lopez-Tamames, et al., 2005Gocmen, Gurbuz, et al., 2004Chisholm, Jell, et al., 2003
Comment MSDC-RI MSDC-RI MSDC-RI MSDC-RI MSDC-RI
Column type CapillaryCapillaryCapillaryCapillaryCapillary
Active phase DB-WaxDB-WaxZB-WaxDB-WaxDB-Wax
Column length (m) 30.30.60.60.30.
Carrier gas  HeHeHeHe
Substrate
Column diameter (mm) 0.320.250.320.250.32
Phase thickness (μm) 0.50.250.250.250.50
Tstart (C) 40.40.40.40.40.
Tend (C) 240.240.220.200.240.
Heat rate (K/min) 7.6.3.2.7.
Initial hold (min)  10. 5.
Final hold (min) 5.30. 30.5.
I 1651.1634.1604.1650.1655.
ReferenceHögnadóttir and Rouseff, 2003Nielsen, Larsen, et al., 2003Brunton, Cronin, et al., 2002Kim, 2001Lin and Rouseff, 2001
Comment MSDC-RI MSDC-RI MSDC-RI MSDC-RI MSDC-RI
Column type CapillaryCapillaryCapillaryCapillaryCapillary
Active phase AT-WaxDB-WaxSupelcowax-10DB-WaxDB-Wax
Column length (m) 60.60.30.60.60.
Carrier gas HeN2He
Substrate
Column diameter (mm) 0.320.250.320.250.25
Phase thickness (μm) 0.250.250.250.250.25
Tstart (C) 65.70.75.40.50.
Tend (C) 250.230.200.200.230.
Heat rate (K/min) 2.2.2.53.2.
Initial hold (min) 10.2. 5.
Final hold (min) 60.20. 60.
I 1637.1648.1651.1642.1616.
ReferencePino, Marbot, et al., 2001Choi and Sawamura, 2000Lazari, Skaltsa, et al., 2000Cha, Kim, et al., 1998Shimoda, Shigematsu, et al., 1995
Comment MSDC-RI MSDC-RI MSDC-RI MSDC-RI MSDC-RI

Van Den Dool and Kratz RI, polar column, custom temperature program

Data compiled by: NIST Mass Spectrometry Data Center, William E. Wallace, director

Column type CapillaryCapillaryCapillaryCapillaryCapillary
Active phase Supelcowax-10CP-Wax 52CBDB-WaxFFAPFFAP
Column length (m) 30.60. 30.30.
Carrier gas HeHe HeHe
Substrate
Column diameter (mm) 0.250.25 0.320.25
Phase thickness (μm) 0.250.25 0.250.25
Program 35C(8min) => 4C/min => 60C => 6C/min => 160C => 20C/min => 200C(1min)45C(5min) => 10C/min => 80C => 2C/min => 240Cnot specified35C (2min) => 40C/min => 60C (2min) => 6C/min => 180C (5min) => 10C/min => 230C (5min)35C(2min) => 40C/min => 60C => 6C/min => 180C 20C/min => 240C(10min)
I 1652.1645.1653.1648.1648.
ReferenceBianchi, Careri, et al., 2007Romeo, Ziino, et al., 2007Elston, Lin, et al., 2005Tairu, Hofmann, et al., 2000Zimmermann and Schieberle, 2000
Comment MSDC-RI MSDC-RI MSDC-RI MSDC-RI MSDC-RI
Column type Capillary
Active phase DB-FFAP
Column length (m) 30.
Carrier gas He
Substrate
Column diameter (mm) 0.32
Phase thickness (μm) 0.25
Program 40C(2min) => 40C/min => 60C(2min) => 6C/min => 230C(10min)
I 1636.
ReferenceMutti and Grosch, 1999
Comment MSDC-RI

References

Romeo, Verzera, et al., 2009
Romeo, V.; Verzera, A.; Ziino, M.; Condurao, C.; Tripodi, G., Headspace volatiles of Vicia sativa L. (Legumnodeae) by solid-phase microextraction and gas chromatography/mass spectrometry, J. Ess. Oil Res., 2009, 21, 1, 33-35, https://doi.org/10.1080/10412905.2009.9700101 . [all data]

Liolios, Laouer, et al., 2007
Liolios, C.; Laouer, H.; Boulaacheb, N.; Gortzi, O.; Chinou, I., Chemical Composition and Antimicrobial Activity of the Essential Oil of Algherian Phlomis bovei De Noe subsp. bovei, Molecules, 2007, 12, 4, 772-781, https://doi.org/10.3390/12040772 . [all data]

Vichi, Guadayol, et al., 2007
Vichi, S.; Guadayol, J.M.; Caixach, J.; López-Tamames, E.; Buxaderas, S., Analytical, Nutritional, and Clinical Methods. Comparative study of different extraction techniques for the analysis of virgin olive oil aroma, Food Chem., 2007, 105, 3, 1171-1178, https://doi.org/10.1016/j.foodchem.2007.02.018 . [all data]

Baser K.H.C., Ozek G., et al., 2006
Baser K.H.C.; Ozek G.; Ozek T.; Duran A., Composition of the essential oil of Centaurea huber-morathii Wagenitz isolated from seeds by microdistillation, Flavour Fragr. J., 2006, 21, 3, 568-570, https://doi.org/10.1002/ffj.1620 . [all data]

Baser, Özek, et al., 2006
Baser, K.H.C.; Özek, G.; Özek, T.; Duran, A.; Duman, H., Composition of the essential oils of Rhabdosciadium oligocarpum (Post ex Boiss.) Hedge et Lamond and Rhabdosciadium microcalycinum Hand.-Mazz., Flavour Fragr. J., 2006, 21, 4, 650-655, https://doi.org/10.1002/ffj.1639 . [all data]

Tabanca, Demirci, et al., 2006
Tabanca, N.; Demirci, B.; Ozek, T.; Kirimer, N.; Can Baser, K.H.; Bedir, E.; Khan, I.A.; Wedge, D.E., Gas chromatographic-mass spectrometric analysis of essential oils from Pimpinella species gathered from Central and Northern Turkey, J. Chromatogr. A, 2006, 1117, 2, 194-205, https://doi.org/10.1016/j.chroma.2006.03.075 . [all data]

Kosar, Özek, et al., 2005
Kosar, M.; Özek, T.; Göger, F.; Kürkcüoglu, M.; Hüsnü Can Baser, K., Comparison of Microwave-Assisted Hydrodistillation and Hydrodistillation Methods for the Analysis of Volatile Secondary Metabolites, Pharm. Biol., 2005, 43, 6, 491-495, https://doi.org/10.1080/13880200500220136 . [all data]

Sezik E., Kocakulak E., et al., 2005
Sezik E.; Kocakulak E.; Baser K.H.C.; Ozek T., Composition of the essential oils of Juniperus oxycedrus subsp macrocarpa from Turkey, Chem. Nat. Compd. (Engl. Transl.), 2005, 41, 3, 352-354, https://doi.org/10.1007/s10600-005-0149-0 . [all data]

Altintas, Kose, et al., 2004
Altintas, A.; Kose, Y.B.; Yucel, E.; Demirci, B.; Baser, K.H.C., Composition of the essential oil of Centaurea dichroa, Chem. Nat. Compd. (Engl. Transl.), 2004, 40, 6, 604-605, https://doi.org/10.1007/s10600-005-0051-9 . [all data]

Vinogradov, 2004
Vinogradov, B.A., Production, composition, properties and application of essential oils, 2004, retrieved from http://viness.narod.ru. [all data]

Triqui and Bouchriti, 2003
Triqui, R.; Bouchriti, N., Freshness assessments of Moroccan sardine (Sardina pilchardus): comparison of overall sensory changes to instrumentally determined volatiles, J. Agric. Food Chem., 2003, 51, 26, 7540-7546, https://doi.org/10.1021/jf0348166 . [all data]

Kivcak B., Mert T., et al., 2001
Kivcak B.; Mert T.; Demirci B.; Baser K.H.C., Composition of the essential oil of Arbutus unedo, Chem. Nat. Compd. (Engl. Transl.), 2001, 37, 5, 445-446, https://doi.org/10.1023/A:1014419309885 . [all data]

Özcan, Akgül, et al., 2001
Özcan, M.; Akgül, A.; Bascr, K.H.C.; Özck, T.; Tabanca, N., Essential oil composition of sea fennel (Crithmum maritimum) form Turkey, Nahrung/Food, 2001, 45, 5, 353-356, https://doi.org/10.1002/1521-3803(20011001)45:5<353::AID-FOOD353>3.0.CO;2-4 . [all data]

Baser, Özek, et al., 2000
Baser, K.H.C.; Özek, T.; Demirci, B.; Duman, H., Composition of the essential oil of Prangos heyniae H. Duman et M. F. Watson, a new endemic from Turkey, Flavour Fragr. J., 2000, 15, 1, 47-49, https://doi.org/10.1002/(SICI)1099-1026(200001/02)15:1<47::AID-FFJ869>3.0.CO;2-9 . [all data]

Baser, Tabanca, et al., 2000
Baser, K.H.C.; Tabanca, N.; Özek, T.; Demirci, B.; Duran, A.; Duman, H., Composition of the essential oil of Chaerophyllum aksekiense A. Duran et Duman, a recently described endemic from Turkey, Flavour Fragr. J., 2000, 15, 1, 43-44, https://doi.org/10.1002/(SICI)1099-1026(200001/02)15:1<43::AID-FFJ864>3.0.CO;2-# . [all data]

Kirimer, Tabanca, et al., 2000
Kirimer, N.; Tabanca, N.; Özek, T.; Tümen, G.; Baser, K.H.C., Essential oils of annual Sideritis species growing in Turkey, Pharm. Biol., 2000, 38, 2, 106-111, https://doi.org/10.1076/1388-0209(200004)3821-1FT106 . [all data]

Matsui, Guth, et al., 1998
Matsui, T.; Guth, H.; Grosch, W., A comparative study of potent odorants in peanut, hazelnut, and pumpkin seed oils on the basis of aroma extract dilution analysis (AEDA) and gas chromatography-olfactometry of headspace samples (GCOH), Lipid - Fett, 1998, 100, 2, 51-56, https://doi.org/10.1002/(SICI)1521-4133(199802)100:2<51::AID-LIPI51>3.0.CO;2-W . [all data]

Schermann and Schieberle, 1997
Schermann, P.; Schieberle, P., Evaluation of key odorants in milk chocolate and cocoa mass by aroma extract dilution analyses, J. Agric. Food Chem., 1997, 45, 3, 867-872, https://doi.org/10.1021/jf960670h . [all data]

Patterson and Stevenson, 1995
Patterson, R.L.S.; Stevenson, M.H., Irradiation-induced off-odor in chicken and its possible control, British Poultry Science, 1995, 36, 3, 425-441, https://doi.org/10.1080/00071669508417789 . [all data]