2-Decenal

Van Den Dool and Kratz RI, polar column, custom temperature program

Data compiled by: NIST Mass Spectrometry Data Center, William E. Wallace, director

Column type Capillary
Active phase CP-Wax 52CB
Column length (m) 60.
Carrier gas He
Substrate
Column diameter (mm) 0.25
Phase thickness (μm) 0.25
Program 45C(5min) => 10C/min => 80C => 2C/min => 240C
I 1647.
ReferenceVerzera, Ziino, et al., 2004
Comment MSDC-RI

Kovats' RI, non-polar column, custom temperature program

Data compiled by: NIST Mass Spectrometry Data Center, William E. Wallace, director

Column type Capillary
Active phase HP-5MS
Column length (m) 30.
Carrier gas He
Substrate
Column diameter (mm) 0.25
Phase thickness (μm) 0.25
Program 40C(3min) => 3C/min => 160C => 10C/min => 200C
I 1266.
ReferenceAlissandrakis E., Tarantilis P.A., et al., 2007
Comment MSDC-RI

Normal alkane RI, non-polar column, temperature ramp

Data compiled by: NIST Mass Spectrometry Data Center, William E. Wallace, director

Column type CapillaryCapillaryCapillaryCapillaryCapillary
Active phase OV-1HP-5 MSSPB-5HP-5SPB-5
Column length (m) 30.30.60.25.60.
Carrier gas HeliumHelium N2Helium
Substrate
Column diameter (mm) 0.250.320.320.20.32
Phase thickness (μm) 0.250.251.0.331.0
Tstart (C) 65.60.40.30.30.
Tend (C) 260.280.230.280.230.
Heat rate (K/min) 6.4.3.3.3.
Initial hold (min)  5.5.
Final hold (min)   5.
I 1272.1263.1267.1265.1263.
ReferenceWang, Yi, et al., 2008Capetanos, Saroglou, et al., 2007Vasta, Ratel, et al., 2007Shafi, Jose, et al., 2006Sebastian, Viallon-Fernandez, et al., 2003
Comment MSDC-RI MSDC-RI MSDC-RI MSDC-RI MSDC-RI
Column type CapillaryCapillaryCapillaryCapillaryCapillary
Active phase Optima-1CBP-1HP-5Ultra-2Ultra-2
Column length (m) 25.25.50.50.50.
Carrier gas HeHe HeHe
Substrate
Column diameter (mm) 0.200.30.320.320.32
Phase thickness (μm) 0.25 0.520.520.52
Tstart (C) 50.60.35.40.40.
Tend (C) 250.240.250.250.250.
Heat rate (K/min) 3.4.2.4.4.
Initial hold (min) 3. 15.3.3.
Final hold (min)   45.30.30.
I 1242.1238.1260.1267.1256.
ReferenceBrun, Bessière, et al., 2001Labuckas, Zygadlo, et al., 1999Boylston and Viniyard, 1998King, Matthews, et al., 1995King, Hamilton, et al., 1993
Comment MSDC-RI MSDC-RI MSDC-RI MSDC-RI MSDC-RI
Column type CapillaryCapillary
Active phase DB-5SE-54
Column length (m) 60.25.
Carrier gas  N2
Substrate
Column diameter (mm) 0.250.25
Phase thickness (μm) 0.25
Tstart (C) 40.60.
Tend (C) 250.260.
Heat rate (K/min) 2.6.
Initial hold (min) 5.2.
Final hold (min)
I 1264.1260.
ReferenceLee, Macku, et al., 1991Bestmann, Classen, et al., 1988
Comment MSDC-RI MSDC-RI

Van Den Dool and Kratz RI, non-polar column, temperature ramp

Data compiled by: NIST Mass Spectrometry Data Center, William E. Wallace, director

Column type CapillaryCapillaryCapillaryCapillaryCapillary
Active phase HP-5MSHP-5CP-Sil 8CB-MSHP-5MSCP-Sil 8CB-MS
Column length (m) 30.30.60.30.60.
Carrier gas HeHe He
Substrate
Column diameter (mm) 0.250.250.250.250.25
Phase thickness (μm) 0.250.250.250.250.25
Tstart (C) 60.60.40.60.40.
Tend (C) 280.250.280.275.280.
Heat rate (K/min) 4.10.4.4.4.
Initial hold (min) 5.2.2. 2.
Final hold (min)  10.5.
I 1256.1270.1267.1262.1267.
ReferenceSaroglou, Dorizas, et al., 2006Zhao J.Y., Liu J.M., et al., 2006Bruna, Hierro, et al., 2003Afsharypuor and Suleimany, 2002Bruna, Hierro, et al., 2001
Comment MSDC-RI MSDC-RI MSDC-RI MSDC-RI MSDC-RI
Column type PackedPackedPackedPacked
Active phase OV-101Apiezon MApiezon MApiezon M
Column length (m) 2.51.51.51.5
Carrier gas  N2N2N2
Substrate Gas-Chrom QCelite 545Celite 545Celite 545
Column diameter (mm)
Phase thickness (μm)
Tstart (C) 50.75.75.75.
Tend (C) 220.200.200.200.
Heat rate (K/min) 2.6.6.6.
Initial hold (min)
Final hold (min)
I 1235.1234.1236.1239.
ReferenceNixon, Wong, et al., 1979Golovnya and Uraletz, 1971Golovnya and Uraletz, 1971Golovnya and Uraletz, 1971
Comment MSDC-RI MSDC-RI MSDC-RI MSDC-RI

Normal alkane RI, polar column, custom temperature program

Data compiled by: NIST Mass Spectrometry Data Center, William E. Wallace, director

Column type CapillaryCapillaryCapillaryCapillaryCapillary
Active phase SOLGel-WaxSOLGel-WaxDB-WaxNB-351CP-Wax 52CB
Column length (m) 30.30.60.25.50.
Carrier gas HeliumHeliumHe
Substrate
Column diameter (mm) 0.250.250.250.320.32
Phase thickness (μm) 0.250.25 0.2
Program 40 0C (2 min) 5 0C/min -> 140 0C 10 0C/min -> 250 0C (3 min)not specified45C(4min) => 30C/min => 60C (5min) => 3C/min => 220C(40min)40C(5min) => 4C/min => 150C => 8C/min => 240C(12min)not specified
I 1658.1652.1659.1684.1630.
ReferenceJohanningsmeier and McFeeters, 2011Johanningsmeier and McFeeters, 2011Ziegleder, 1998Kerrola and Kallio, 1993Vernin, 1991
Comment MSDC-RI MSDC-RI MSDC-RI MSDC-RI MSDC-RI

Van Den Dool and Kratz RI, non-polar column, custom temperature program

Data compiled by: NIST Mass Spectrometry Data Center, William E. Wallace, director

Column type Capillary
Active phase DB-5
Column length (m) 50.
Carrier gas He
Substrate
Column diameter (mm) 0.32
Phase thickness (μm) 0.5
Program oC(5min) => 60C/min => 60C (5min) => 4C/min => 250C
I 1278.
ReferenceParker, Hassell, et al., 2000
Comment MSDC-RI

References

Verzera, Ziino, et al., 2004
Verzera, A.; Ziino, M.; Condurso, C.; Romeo, V.; Zappala, M., Solid-phase microextraction and gas chromatography-mass spectrometry for rapid characterisation of semi-hard cheeses, Anal. Bioanal. Chem., 2004, 380, 7-8, 930-936, https://doi.org/10.1007/s00216-004-2879-4 . [all data]