2-Nonynamide

Condensed phase thermochemistry data

Data compiled as indicated in comments:
DRB - Donald R. Burgess, Jr.
ALS - Hussein Y. Afeefy, Joel F. Liebman, and Stephen E. Stein

Quantity Value Units Method Reference Comment
Δfliquid-49.4 ± 1.2kcal/molCcbN/Arecalculated with modern CO2,H2O thermo; estimated uncertainty (NOTE all values in source also have wrong sign); DRB
Quantity Value Units Method Reference Comment
Δfsolid60.9kcal/molCcbMoureu and Andre, 1914ALS
Quantity Value Units Method Reference Comment
Δcsolid-1309.4kcal/molCcbMoureu and Andre, 1914ALS

References

Moureu and Andre, 1914
Moureu, C.; Andre, E., Thermochimie des composes acetyleniques, Ann. Chim. Phys., 1914, 1, 113-145. [all data]