2,2'-Biindanyl

Condensed phase thermochemistry data

Data compiled by: Eugene S. Domalski and Elizabeth D. Hearing

Constant pressure heat capacity of liquid

Cp,liquid (cal/mol*K) Temperature (K) Reference Comment
79.45298.15Good, Scott, et al., 1978Cp = 0.339 cal/g.

References

Good, Scott, et al., 1978
Good, W.D.; Scott, D.W.; Smith, N.K.; Lee-Bechtold, S.; Osborn, A.G., Thermodynamics of Organic Compounds, U.S. Dept. of Energy Report, 1978, AFOSR-TR-79-0197, 20pp. [all data]