(3R,6S)-2,2,6-Trimethyl-6-vinyltetrahydro-2H-pyran-3-ol

Normal alkane RI, non-polar column, temperature ramp

Data compiled by: NIST Mass Spectrometry Data Center, William E. Wallace, director

Column type CapillaryCapillaryCapillaryCapillaryCapillary
Active phase HP-5 MSDB-1BP-1OV-101DB-1
Column length (m) 30.30.25.50.60.
Carrier gas Helium N2N2
Substrate
Column diameter (mm) 0.250.320.330.20.32
Phase thickness (μm) 0.250.251.0
Tstart (C) 60.60.60.80.50.
Tend (C) 230.230.275.200.250.
Heat rate (K/min) 3.3.4.1.4.
Initial hold (min)  3.  0.1
Final hold (min)  10. 20.5.
I 1183.1147.1169.1165.1150.
ReferencePripdeevech and Saansoomchai, 2013Tohar, Mohd, et al., 2006Mohagheghzadeh, Shams-Ardakani, et al., 2000Menon, Chacko, et al., 1999Flath, Mon, et al., 1983
Comment MSDC-RI MSDC-RI MSDC-RI MSDC-RI MSDC-RI

Kovats' RI, non-polar column, temperature ramp

Data compiled by: NIST Mass Spectrometry Data Center, William E. Wallace, director

Column type CapillaryCapillaryCapillary
Active phase DB-1OV-101OV-101
Column length (m) 25.70.70.
Carrier gas HeN2N2
Substrate
Column diameter (mm) 0.20.280.28
Phase thickness (μm)
Tstart (C) 60.80.80.
Tend (C) 220.200.200.
Heat rate (K/min) 3.2.2.
Initial hold (min) 3.
Final hold (min)
I 1164.1164.1168.
ReferenceMevy, Bessiere, et al., 2006Yamaguchi and Shibamoto, 1981Yamaguchi and Shibamoto, 1981
Comment MSDC-RI MSDC-RI MSDC-RI

References

Pripdeevech and Saansoomchai, 2013
Pripdeevech, P.; Saansoomchai, J., Antibacterial activity and chemical composition of essential oil and various extracts of Fagraea fragrans Roxb. flowers, Chiang Mai J. Sci., 2013, 40, 2, 214-223. [all data]

Tohar, Mohd, et al., 2006
Tohar, N.; Mohd, M.A.; Jantan, I.; Awang, K., A comparative study of the essential oils of the genus Plumeria Linn. from Malaysia, Flavour Fragr. J., 2006, 21, 6, 859-863, https://doi.org/10.1002/ffj.1617 . [all data]

Mohagheghzadeh, Shams-Ardakani, et al., 2000
Mohagheghzadeh, A.; Shams-Ardakani, M.; Ghannadi, A., Linalol-rich essential oil of Zataria multiflora Boiss. (Lamiaceae), Flavour Fragr. J., 2000, 15, 2, 119-122, https://doi.org/10.1002/(SICI)1099-1026(200003/04)15:2<119::AID-FFJ878>3.0.CO;2-V . [all data]

Menon, Chacko, et al., 1999
Menon, A.N.; Chacko, S.; Narayanan, C.S., Free and glycosidically bound volatiles of cardamom (Eletteria cardamomum Maton var. miniscula Burkill), Flavour Fragr. J., 1999, 14, 1, 65-68, https://doi.org/10.1002/(SICI)1099-1026(199901/02)14:1<65::AID-FFJ789>3.0.CO;2-A . [all data]

Flath, Mon, et al., 1983
Flath, R.A.; Mon, T.R.; Lorenz, G.; Whitten, C.J.; Mackley, J.W., Volatile components of Acacia sp. blossoms, J. Agric. Food Chem., 1983, 31, 6, 1167-1170, https://doi.org/10.1021/jf00120a008 . [all data]