Fludiazepam

Kovats' RI, non-polar column, isothermal

View large format table.

Column type Active phase Temperature (C) I Reference Comment
CapillaryBP-1250.2389.Weston, Japp, et al., 199125. m/0.22 mm/0.25 μm, N2
CapillaryDB-1250.2408.Weston, Japp, et al., 199130. m/0.53 mm/1.5 μm, N2

Van Den Dool and Kratz RI, non-polar column, temperature ramp

View large format table.

Column type Active phase I Reference Comment
CapillaryCBP-12363.Oyama, Sano, et al., 1987N2, 6. K/min; Column length: 12. m; Column diameter: 0.53 mm; Tstart: 120. C; Tend: 250. C

Normal alkane RI, non-polar column, temperature ramp

View large format table.

Column type Active phase I Reference Comment
CapillaryDB-52403.Zamechnik, Ethier, et al., 198915. m/0.25 mm/0.25 μm, He, 150. C @ 1. min, 10. K/min; Tend: 260. C

References

Weston, Japp, et al., 1991
Weston, S.I.; Japp, M.; Partridge, J.; Osselton, M.D., Collection of analytical data for benzodiazepines and benzophenones. Appendix, J. Chromatogr., 1991, 538, 2, 277-284, https://doi.org/10.1016/S0021-9673(01)88848-8 . [all data]

Oyama, Sano, et al., 1987
Oyama, N.; Sano, T.; Syoyama, M.; Maeda, K., Studies on systematic analysis of poisonous compounds in forensic chemistry. II. Application of capillary column gas chromatography to substance identification by means of retention indices, Eisei Kagaku, 1987, 33, 5, 342-348, https://doi.org/10.1248/jhs1956.33.342 . [all data]

Zamechnik, Ethier, et al., 1989
Zamechnik, J.; Ethier, J.-C.; Neville, G.A., Benzodiazepines- an extensive collection of mass spectra, J. Can. Soc. Forensic Sci., 1989, 22, 3, 233-259, https://doi.org/10.1080/00085030.1989.10757437 . [all data]