C14H10BrF6NO5

Gas phase ion energetics data

Data compiled by: John E. Bartmess

De-protonation reactions

C14H9BrF6NO5- + Hydrogen cation = C14H10BrF6NO5

By formula: C14H9BrF6NO5- + H+ = C14H10BrF6NO5

Quantity Value Units Method Reference Comment
Δr1333. ± 8.8kJ/molG+TSMishima, Matsuoka, et al., 2004gas phase; Calc: enol form of acid more stable.
Quantity Value Units Method Reference Comment
Δr1295. ± 8.4kJ/molIMREMishima, Matsuoka, et al., 2004gas phase; Calc: enol form of acid more stable.

Reaction thermochemistry data

Data compiled by: John E. Bartmess

Individual Reactions

C14H9BrF6NO5- + Hydrogen cation = C14H10BrF6NO5

By formula: C14H9BrF6NO5- + H+ = C14H10BrF6NO5

Quantity Value Units Method Reference Comment
Δr1333. ± 8.8kJ/molG+TSMishima, Matsuoka, et al., 2004gas phase; Calc: enol form of acid more stable.
Quantity Value Units Method Reference Comment
Δr1295. ± 8.4kJ/molIMREMishima, Matsuoka, et al., 2004gas phase; Calc: enol form of acid more stable.

References

Mishima, Matsuoka, et al., 2004
Mishima, M.; Matsuoka, M.; Lei, Y.X.; Rappoport, Z., Gas-phase acidities of disubstituted methanes and of enols of carboxamides substituted by electron-withdrawing groups, J. Org. Chem., 2004, 69, 18, 5947-5965, https://doi.org/10.1021/jo040196b . [all data]