Pentadecane, 2,6,10-trimethyl-

Van Den Dool and Kratz RI, non-polar column, temperature ramp

Data compiled by: NIST Mass Spectrometry Data Center, William E. Wallace, director

Column type CapillaryCapillaryCapillary
Active phase Cross-Linked MethylsiliconeOV-1OV-1
Column length (m)  50.50.
Carrier gas  H2H2
Substrate
Column diameter (mm)  0.300.30
Phase thickness (μm)  0.150.15
Tstart (C) 40.60.60.
Tend (C) 300.280.280.
Heat rate (K/min) 5.0.50.5
Initial hold (min)
Final hold (min)
I 1654.1653.1652.
ReferenceKhorasheh, Gray, et al., 1989Berthou and Friocourt, 1981Berthou and Friocourt, 1981
Comment MSDC-RI MSDC-RI MSDC-RI

References

Khorasheh, Gray, et al., 1989
Khorasheh, F.; Gray, M.R.; Selucky, M.L., Correlation for Kováts retention index of C9-C26 monoalkyl and polymethyl alkanes and alkenes, J. Chromatogr., 1989, 481, 1-16, https://doi.org/10.1016/S0021-9673(01)96747-0 . [all data]

Berthou and Friocourt, 1981
Berthou, F.; Friocourt, M.P., Gas Chromatographic Separation of Diastereomeric Isoprenoids as Molecular Markers of Oil Pollution, J. Chromatogr., 1981, 219, 3, 393-402, https://doi.org/10.1016/S0021-9673(00)80383-0 . [all data]