2,6,10-Trimethyltridecane

Kovats' RI, non-polar column, isothermal

View large format table.

Column type Active phase Temperature (C) I Reference Comment
CapillarySE-30200.1463.Shlyakhov, 1984
Capillaryn-Dotriacontane200.1457.Shlyakhov, 1984
CapillaryApiezon L200.1446.Shlyakhov, 1984
CapillaryApiezon L200.1449.Shlyakhov, 1984
PackedApiezon L200.1446.4Fisch, Olácsi, et al., 1980
PackedSE-30150.1461.Shlyakhov, Anvaer, et al., 1975
PackedSE-30200.1463.Shlyakhov, Anvaer, et al., 1975
PackedApiezon L130.1448.Shlyakhov, Anvaer, et al., 1975
PackedApiezon L150.1448.Shlyakhov, Anvaer, et al., 1975
CapillarySE-30100.1463.Shlyakhov, Koreshkova, et al., 1975
CapillaryApiezon L100.1449.Shlyakhov, Koreshkova, et al., 1975

Kovats' RI, non-polar column, custom temperature program

View large format table.

Column type Active phase I Reference Comment
CapillaryHP-5MS1461.Kenig, Simons, et al., 200530. m/0.25 mm/0.25 μm, He; Program: 60C(1.5min) => 20C/min => 130C => 4C/min => 315C (90min)
CapillaryApiezon L1442.Shlyakhov, 1984Program: not specified
CapillaryApiezon L1446.Shlyakhov, 1984Program: not specified
CapillaryApiezon L1448.Shlyakhov, 1984Program: not specified
CapillaryApiezon L1448.Shlyakhov, 1984Program: not specified
CapillaryApiezon L1449.Shlyakhov, 1984Program: not specified
CapillaryApiezon L1449.Shlyakhov, 1984Program: not specified
CapillaryApiezon L1450.Shlyakhov, 1984Program: not specified

Van Den Dool and Kratz RI, non-polar column, temperature ramp

View large format table.

Column type Active phase I Reference Comment
CapillaryDB-51462.Flamini, Cioni, et al., 200230. m/0.25 mm/0.25 μm, He, 3. K/min; Tstart: 60. C; Tend: 240. C
CapillaryCross-Linked Methylsilicone1467.Khorasheh, Gray, et al., 19895. K/min; Tstart: 40. C; Tend: 300. C

Van Den Dool and Kratz RI, non-polar column, custom temperature program

View large format table.

Column type Active phase I Reference Comment
CapillaryHP-5MS1465.1Andriamaharavo, 201430. m/0.25 mm/0.25 μm, He; Program: 60C (1 min) => 5 C/min => 210C => 10 C/min => 280C (15 min)

Normal alkane RI, non-polar column, temperature ramp

View large format table.

Column type Active phase I Reference Comment
CapillaryApieson L1449.Albaigès, Borbón, et al., 1981He, Gas-Chrom Q, 6. K/min; Column length: 50. m; Column diameter: 0.25 mm; Tstart: 120. C; Tend: 280. C

Normal alkane RI, non-polar column, custom temperature program

View large format table.

Column type Active phase I Reference Comment
CapillarySqualane1450.Petrov, 1984Program: not specified
CapillaryApiezon L1442.Douglas, Blumer, et al., 1971Program: not specified

References

Shlyakhov, 1984
Shlyakhov, A.F., Gas chromatography in organic geochemistry, Nedra, Moscow, 1984, 221. [all data]

Fisch, Olácsi, et al., 1980
Fisch, I.; Olácsi, I.; Takács, J.; Vörós, J., Pyrolysis and gas chromatographic examination of phytol and isoprenoid hydrocarbons. Pre-calculation of retention indices by computer, J. Anal. Appl. Pyrolysis, 1980, 1, 4, 275-295, https://doi.org/10.1016/0165-2370(80)80013-1 . [all data]

Shlyakhov, Anvaer, et al., 1975
Shlyakhov, A.F.; Anvaer, B.I.; Zolotareva, O.V.; Romina, N.N.; Novikova, N.V.; Koreshkova, R.I., On the possibility of group indentification of hydrocarbons by gas chromatography from temperature coefficients of retention indices, Zh. Anal. Khim., 1975, 30, 788-792. [all data]

Shlyakhov, Koreshkova, et al., 1975
Shlyakhov, A.F.; Koreshkova, R.I.; Telkova, M.S., Gas Chromatography of Isoprenoid Alkanes, J. Chromatogr., 1975, 104, 2, 337-349, https://doi.org/10.1016/S0021-9673(00)91857-0 . [all data]

Kenig, Simons, et al., 2005
Kenig, F.; Simons, D.-J.H.; Crich, D.; Cowen, J.P.; Ventura, G.T.; Rehbein-Khalily, T., Structure and distribution of branched aliphatic alkanes with quaternary carbon atoms in Cenomanian and Turonian black shales of Pasquia Hills (Saskatchewan, Canada), Org. Geochem., 2005, 36, 1, 117-138, https://doi.org/10.1016/j.orggeochem.2004.06.014 . [all data]

Flamini, Cioni, et al., 2002
Flamini, G.; Cioni, P.L.; Morelli, I., Analysis of the essential oil of the aerial parts of Viola etrusca from Monte Labbro (South Tuscany, Italy) and in vivo analysis of flower volatiles using SPME, Flavour Fragr. J., 2002, 17, 2, 147-149, https://doi.org/10.1002/ffj.1060 . [all data]

Khorasheh, Gray, et al., 1989
Khorasheh, F.; Gray, M.R.; Selucky, M.L., Correlation for Kováts retention index of C9-C26 monoalkyl and polymethyl alkanes and alkenes, J. Chromatogr., 1989, 481, 1-16, https://doi.org/10.1016/S0021-9673(01)96747-0 . [all data]

Andriamaharavo, 2014
Andriamaharavo, N.R., Retention Data. NIST Mass Spectrometry Data Center., NIST Mass Spectrometry Data Center, 2014. [all data]

Albaigès, Borbón, et al., 1981
Albaigès, J.; Borbón, J.; Gassiot, M., Gas chromatographic-mass spectrometric identification of geochemically significant isoalkane hydrocarbons, J. Chromatogr., 1981, 204, 491-498, https://doi.org/10.1016/S0021-9673(00)81696-9 . [all data]

Petrov, 1984
Petrov, A.A., Hydrocarbons of petroleum, Nauka (publishing house), Moscow, 1984, 263. [all data]

Douglas, Blumer, et al., 1971
Douglas, A.G.; Blumer, M.; Eglinton, G.; Douraghi-Zadeh, K., Gas chromatographic-mass spectrometric characterization of naturally-occurring acyclic isoprenoid carboxylic acids, Tetrahedron, 1971, 27, 6, 1071-1092, https://doi.org/10.1016/S0040-4020(01)90855-5 . [all data]