D-Glucose, 2,3,4,5,6-pentaacetate

Normal alkane RI, non-polar column, temperature ramp

View large format table.

Column type Active phase I Reference Comment
CapillaryPolydimethyl siloxane2010.MAurer and Pfleger, 198612. m/0.20 mm/0.33 μm, Helium, 100. C @ 3. min, 30. K/min, 310. C @ 5. min

References

MAurer and Pfleger, 1986
MAurer, H.; Pfleger, K., IDentification and differentiation of beta-blockers and their metabolites in urine by computerized gas chromatography - mass spectrometry, J. Chromatogr., 1986, 382, 147-165, https://doi.org/10.1016/S0378-4347(00)83513-6 . [all data]