1,4-Bis-(vinyloxy)-butane

Phase change data

Data compiled by: William E. Acree, Jr., James S. Chickos

Enthalpy of vaporization

ΔvapH (kJ/mol) Temperature (K) Method Reference Comment
49.0350.AStephenson and Malanowski, 1987Based on data from 335. - 440. K.

Reaction thermochemistry data

Data compiled by: Hussein Y. Afeefy, Joel F. Liebman, and Stephen E. Stein

Individual Reactions

2Hydrogen + 1,4-Bis-(vinyloxy)-butane = Butane, 1,4-diethoxy-

By formula: 2H2 + C8H14O2 = C8H18O2

Quantity Value Units Method Reference Comment
Δr-222.0 ± 1.3kJ/molChydAllinger, Glaser, et al., 1981liquid phase; solvent: Hexane

References

Stephenson and Malanowski, 1987
Stephenson, Richard M.; Malanowski, Stanislaw, Handbook of the Thermodynamics of Organic Compounds, 1987, https://doi.org/10.1007/978-94-009-3173-2 . [all data]

Allinger, Glaser, et al., 1981
Allinger, N.L.; Glaser, J.A.; Davis, H.E., Heats of hydrogenation of some vinyl ethers and related compounds, J. Org. Chem., 1981, 46, 658-661. [all data]