pentylurea

Phase change data

Data compiled by: William E. Acree, Jr., James S. Chickos

Enthalpy of fusion

ΔfusH (kJ/mol) Temperature (K) Method Reference
21.0375.2DSCHashimoto, Tajima, et al., 2005

References

Hashimoto, Tajima, et al., 2005
Hashimoto, Masao; Tajima, Fukue; Eda, Kazuo; Yamamura, Kimiaki; Okazaki, Tadashi, Exploration of plastic-like phases in alkylurea systems. A thermal and X-ray study, Journal of Molecular Structure, 2005, 734, 1-3, 23-33, https://doi.org/10.1016/j.molstruc.2004.08.008 . [all data]