Cesium propionate

Phase change data

Data compiled as indicated in comments:
TRC - Thermodynamics Research Center, NIST Boulder Laboratories, Chris Muzny director
DH - Eugene S. Domalski and Elizabeth D. Hearing

Quantity Value Units Method Reference Comment
Tfus580.KN/AFerloni, Sanesi, et al., 1975Crystal phase 1 phase; Uncertainty assigned by TRC = 1. K; TRC

Enthalpy of phase transition

ΔHtrs (kJ/mol) Temperature (K) Initial Phase Final Phase Reference Comment
1.340314.crystaline, IIIcrystaline, IIFerloni, Sanesi, et al., 1975, 2DH
1.925419.crystaline, IIcrystaline, IFerloni, Sanesi, et al., 1975, 2DH
11.715580.crystaline, IliquidFerloni, Sanesi, et al., 1975, 2DH

Entropy of phase transition

ΔStrs (J/mol*K) Temperature (K) Initial Phase Final Phase Reference Comment
4.3314.crystaline, IIIcrystaline, IIFerloni, Sanesi, et al., 1975, 2DH
4.6419.crystaline, IIcrystaline, IFerloni, Sanesi, et al., 1975, 2DH
20.2580.crystaline, IliquidFerloni, Sanesi, et al., 1975, 2DH

In addition to the Thermodynamics Research Center (TRC) data available from this site, much more physical and chemical property data is available from the following TRC products:

References

Ferloni, Sanesi, et al., 1975
Ferloni, P.; Sanesi, M.; Franzosini, P., Phase transitions in the alkali C1-n.C4 alkanoates, Z. Naturforsch., A: Phys., Phys. Chem., Kosmophys., 1975, 30, 1447-57. [all data]

Ferloni, Sanesi, et al., 1975, 2
Ferloni, P.; Sanesi, M.; Franzosini, P.; C4 alkanoates, Phase transitions in the alkali C1-n., Z. Naturforsch. 30a, 1975, 1447-1454. [all data]