Alpha-caran-3-ol

Condensed phase thermochemistry data

Data compiled by: Hussein Y. Afeefy, Joel F. Liebman, and Stephen E. Stein

Quantity Value Units Method Reference Comment
Δfsolid-329.2 ± 3.1kJ/molCcrKozina, Lukyanova, et al., 1980
Quantity Value Units Method Reference Comment
Δcsolid-6178.1 ± 3.0kJ/molCcrKozina, Lukyanova, et al., 1980Corresponding Δfsolid = -329. kJ/mol (simple calculation by NIST; no Washburn corrections)

Phase change data

Data compiled as indicated in comments:
ALS - Hussein Y. Afeefy, Joel F. Liebman, and Stephen E. Stein
DRB - Donald R. Burgess, Jr.

Quantity Value Units Method Reference Comment
Δsub18.98kcal/molCKozina, Lukyanova, et al., 1980ALS
Δsub18.9kcal/molN/AKozina, Lukyanova, et al., 1980DRB

References

Kozina, Lukyanova, et al., 1980
Kozina, M.P.; Lukyanova, V.A.; Galchenko, G.L.; Deshchits, G.V.; Bardyshev, I.A., Enthalpies of combustion and formation of α- and β-caran-3-ols, Vestsi Akad. Nauk BSSR, Ser. Khim. Nauk, 1980, 31-33. [all data]