Bis(diisopropylbenzene)chromium

Condensed phase thermochemistry data

Data compiled by: Eugene S. Domalski and Elizabeth D. Hearing

Quantity Value Units Method Reference Comment
solid,1 bar136.0cal/mol*KN/ANikolaev, Safonov, et al., 1972

Constant pressure heat capacity of solid

Cp,solid (cal/mol*K) Temperature (K) Reference Comment
151.5298.15Nikolaev, Safonov, et al., 1972T = 60 to 298.15 K.

References

Nikolaev, Safonov, et al., 1972
Nikolaev, P.N.; Safonov, V.A.; Moseeva, E.M.; Rabinovich, I.B., Specific heat and solid-state transitions of bis(arene)chromium halides, Tr. Khim. Khim. Tekhnol., 1972, (2), 54-60. [all data]