1,4,13,16-tetraoxadispiro[4.6.4.6]docosane

Phase change data

Data compiled by: Thermodynamics Research Center, NIST Boulder Laboratories, Chris Muzny director

Quantity Value Units Method Reference Comment
Tfus457.KN/AAlvik, Borgen, et al., 1972Uncertainty assigned by TRC = 1. K

In addition to the Thermodynamics Research Center (TRC) data available from this site, much more physical and chemical property data is available from the following TRC products:

References

Alvik, Borgen, et al., 1972
Alvik, T.; Borgen, G.; Dale, J., Conformational Studies of Normal, Medium, and Large Ring Diametric Cycloalkanediones and Their Ethylene Ketal Derivatives., Acta Chem. Scand., 1972, 26, 1805, https://doi.org/10.3891/acta.chem.scand.26-1805 . [all data]