C13HF9N2

Reaction thermochemistry data

Data compiled by: John E. Bartmess

Individual Reactions

C13F9N2- + Hydrogen cation = C13HF9N2

By formula: C13F9N2- + H+ = C13HF9N2

Quantity Value Units Method Reference Comment
Δr1285. ± 8.4kJ/molIMREKoppel, Koppel, et al., 1998gas phase; Slightly revised value of Koppel, Taft, et al., 1994

Gas phase ion energetics data

Data compiled by: John E. Bartmess

De-protonation reactions

C13F9N2- + Hydrogen cation = C13HF9N2

By formula: C13F9N2- + H+ = C13HF9N2

Quantity Value Units Method Reference Comment
Δr307.2 ± 2.0kcal/molIMREKoppel, Koppel, et al., 1998gas phase; Slightly revised value of Koppel, Taft, et al., 1994

References

Koppel, Koppel, et al., 1998
Koppel, I.; Koppel, J.; Maria, P.C.; Gal, J.F.; Notario, R.; Vlasov, V.M.; Taft, R.W., Comparison of Bronsted acidities of neutral NH-acids in gas phase, dimethyl sulfoxide and water, Int. J. Mass Spectrom., 1998, 175, 1-2, 61-69, https://doi.org/10.1016/S0168-1176(98)00113-X . [all data]

Koppel, Taft, et al., 1994
Koppel, I.A.; Taft, R.W.; Anvia, F.; Zhu, S.Z.; Hu, L.Q.; Sung, K.S.; Desmarteau, D.D.; Yagupolskii, L.M., The Gas-Phase Acidities of Very Strong Neutral Bronsted Acids, J. Am. Chem. Soc., 1994, 116, 7, 3047, https://doi.org/10.1021/ja00086a038 . [all data]