Pyrazolidine,1,2-bis(1-methylethyl)-

Gas phase ion energetics data

Data compiled as indicated in comments:
LBLHLM - Sharon G. Lias, John E. Bartmess, Joel F. Liebman, John L. Holmes, Rhoda D. Levin, and W. Gary Mallard
LLK - Sharon G. Lias, Rhoda D. Levin, and Sherif A. Kafafi

Ionization energy determinations

IE (eV) Method Reference Comment
8.31PENelsen, 1984Vertical value; LBLHLM
7.81PENelsen, Peacock, et al., 1976Vertical value; LLK
7.81PENelsen and Buschek, 1974Vertical value; LLK
7.807PENelsen and Buschek, 1974, 2Vertical value; LLK
7.89PENelsen and Buschek, 1973Vertical value; LLK

References

Nelsen, 1984
Nelsen, S.F., Ionization from nitrogen and oxygen lone pairs: A comparison of trialkylamine, dialkyl ether, tetraalkylhydrazine, and dialkyl peroxide photoelectron spectroscopic ionization potentials, J. Org. Chem., 1984, 49, 1891. [all data]

Nelsen, Peacock, et al., 1976
Nelsen, S.F.; Peacock, V.; Weisman, G.R., Single-electron oxidation equilibria of tetraalkylhydrazines. Comparison of solution E° values and vapor-phase ionization potentials, J. Am. Chem. Soc., 1976, 98, 5269. [all data]

Nelsen and Buschek, 1974
Nelsen, S.F.; Buschek, J.M., Photoelectron spectra of hydrazines. V. Pyrazolidine and hexahydropyridazine derivatives, J. Am. Chem. Soc., 1974, 96, 6987. [all data]

Nelsen and Buschek, 1974, 2
Nelsen, S.F.; Buschek, J.M., Photoelectron spectra of hydrazines. IV. Empirical estimation of lone pair-lone pair dihedral angles and prediction of lone pair ionization potentials for some cyclic and bicyclic hydrazines, J. Am. Chem. Soc., 1974, 96, 6982. [all data]

Nelsen and Buschek, 1973
Nelsen, S.F.; Buschek, J.M., Photoelectron spectra of hydrazines. I. Dependence of the lone pair-lone pair splitting on dihedral angle for tetraalkylhydrazines, J. Am. Chem. Soc., 1973, 95, 2011. [all data]