2,2,2-Trinitro-1-phenylethane

Gas phase thermochemistry data

Data compiled by: Hussein Y. Afeefy, Joel F. Liebman, and Stephen E. Stein

Quantity Value Units Method Reference Comment
Δfgas65.7 ± 4.2kJ/molCcbPepekin, Matyushin, et al., 1972

Condensed phase thermochemistry data

Data compiled by: Hussein Y. Afeefy, Joel F. Liebman, and Stephen E. Stein

Quantity Value Units Method Reference Comment
Δfsolid-18. ± 4.kJ/molCcbPepekin, Matyushin, et al., 1972
Quantity Value Units Method Reference Comment
Δcsolid-4130. ± 4.kJ/molCcbPepekin, Matyushin, et al., 1972

Phase change data

Data compiled as indicated in comments:
ALS - Hussein Y. Afeefy, Joel F. Liebman, and Stephen E. Stein
AC - William E. Acree, Jr., James S. Chickos

Quantity Value Units Method Reference Comment
Δsub84.1 ± 0.4kJ/molVPepekin, Matyushin, et al., 1972ALS

Enthalpy of sublimation

ΔsubH (kJ/mol) Temperature (K) Method Reference Comment
84.1 ± 0.4301.MEPepekin, Matyushin, et al., 1972Based on data from 293. - 308. K. See also Pedley and Rylance, 1977 and Stephenson and Malanowski, 1987.; AC

References

Pepekin, Matyushin, et al., 1972
Pepekin, V.I.; Matyushin, Yu.N.; Rozantsev, G.G.; Shevelev, S.A.; Apin, A.Ya., Enthalpies of formation of dinitrophenylmethane, trinitrophenylethane, and fluorodinitrophenylamine, Bull. Acad. Sci. USSR, Div. Chem. Sci., 1972, 2634-2636. [all data]

Pedley and Rylance, 1977
Pedley, J.B.; Rylance, J., , Computer Analysed Thermochemical Data: Organic and Organometallic Compounds, University of Sussex, Brighton, 1977. [all data]

Stephenson and Malanowski, 1987
Stephenson, Richard M.; Malanowski, Stanislaw, Handbook of the Thermodynamics of Organic Compounds, 1987, https://doi.org/10.1007/978-94-009-3173-2 . [all data]