Germane, trimethyl(methylthio)-

Gas phase ion energetics data

Data compiled by: Sharon G. Lias, Rhoda D. Levin, and Sherif A. Kafafi

Ionization energy determinations

IE (eV) Method Reference Comment
8.50 ± 0.05PEDistefano, Ricci, et al., 1974Vertical value

References

Distefano, Ricci, et al., 1974
Distefano, G.; Ricci, A.; Colonna, F.P.; Pietropaolo, D.; Pignataro, S., Bonding between sulfur and the elements of Group IV studied by UV photoelectron spectroscopy, J. Organomet. Chem., 1974, 78, 93. [all data]