Calacorene

Van Den Dool and Kratz RI, non-polar column, temperature ramp

Data compiled by: NIST Mass Spectrometry Data Center, William E. Wallace, director

Column type CapillaryCapillary
Active phase HP-5HP-5
Column length (m) 30.30.
Carrier gas HeHe
Substrate
Column diameter (mm) 0.250.25
Phase thickness (μm) 0.250.25
Tstart (C) 40.50.
Tend (C) 250.280.
Heat rate (K/min) 3.4.
Initial hold (min)  5.
Final hold (min)
I 1541.1562.
ReferenceIsidorov, Krajewska, et al., 2004Lazari, Skaltsa, et al., 2000
Comment MSDC-RI MSDC-RI

Normal alkane RI, polar column, temperature ramp

Data compiled by: NIST Mass Spectrometry Data Center, William E. Wallace, director

Column type CapillaryCapillaryCapillaryCapillaryCapillary
Active phase BP-20BP-20BP-20BP-20BP-20
Column length (m) 25.25.25.25.25.
Carrier gas H2H2H2H2H2
Substrate
Column diameter (mm) 0.330.330.330.330.33
Phase thickness (μm) 0.50.50.50.50.5
Tstart (C) 80.80.80.80.80.
Tend (C) 220.220.220.220.220.
Heat rate (K/min) 5.5.5.5.5.
Initial hold (min)
Final hold (min)
I 1932.1932.1932.1932.1932.
ReferenceBignell, Dunlop, et al., 1998Bignell, Dunlop, et al., 1997Bignell, Dunlop, et al., 1997, 2Bignell, Dunlop, et al., 1997, 3Bignell, Dunlop, et al., 1997, 4
Comment MSDC-RI MSDC-RI MSDC-RI MSDC-RI MSDC-RI
Column type CapillaryCapillaryCapillaryCapillary
Active phase BP-20BP-20SP-1000DB-Wax
Column length (m) 25.25.85.60.
Carrier gas  H2He
Substrate
Column diameter (mm) 0.330.330.500.32
Phase thickness (μm) 0.50.5
Tstart (C) 80.80.65.50.
Tend (C) 220.220.225.230.
Heat rate (K/min) 5.5.3.4.
Initial hold (min)
Final hold (min)    10.
I 1932.1932.1916.1926.
ReferenceBignell, Dunlop, et al., 1997, 5Bignell, Dunlop, et al., 1997, 6Brophy, Goldsack, et al., 1996Binder, Turner, et al., 1990
Comment MSDC-RI MSDC-RI MSDC-RI MSDC-RI

Normal alkane RI, polar column, custom temperature program

Data compiled by: NIST Mass Spectrometry Data Center, William E. Wallace, director

Column type CapillaryCapillary
Active phase HP-20MSupelcowax-10
Column length (m)  30.
Carrier gas  He
Substrate
Column diameter (mm)  0.25
Phase thickness (μm)  0.25
Program not specified40C(3min) => 4C/min => 75C => 8C/min => 260C(5min)
I 1918.1917.
ReferenceChaieb, Hajlaoui, et al., 2007Vichi, Guadayol, et al., 2006
Comment MSDC-RI MSDC-RI

References

Isidorov, Krajewska, et al., 2004
Isidorov, V.A.; Krajewska, U.; Vinogorova, V.T.; Vetchinnikova, L.V.; Fuksman, I.L.; Bal, K., Gas chromatographic analysis of essential oil from buds of different birch species with preliminary partition of components, Biochem. Syst. Ecol., 2004, 32, 1, 1-13, https://doi.org/10.1016/S0305-1978(03)00175-3 . [all data]

Lazari, Skaltsa, et al., 2000
Lazari, D.M.; Skaltsa, H.D.; Constantinidis, T., Volatile constituents of Centaurea pelia DC., C. thessala Hausskn. subsp. drakiensis (Freyn Sint.) Georg. and C. zuccariniana DC. from Greece, Flavour Fragr. J., 2000, 15, 1, 7-11, https://doi.org/10.1002/(SICI)1099-1026(200001/02)15:1<7::AID-FFJ860>3.0.CO;2-3 . [all data]