1-Chloromethyl-3-(1,1-dimethylethyl)benzene

Gas phase ion energetics data

Data compiled by: Sharon G. Lias, Rhoda D. Levin, and Sherif A. Kafafi

Ionization energy determinations

IE (eV) Method Reference
8.71 ± 0.03PIPonomarev, Takhimova, et al., 1974

References

Ponomarev, Takhimova, et al., 1974
Ponomarev, D.A.; Takhimova, V.V.; Akopyan, M.E.; Sergeyev, Y.L., Effect of alkyl groups on the stability of cations in the absence of solvation effects, Zh. Org. Khim., 1974, 10, 403. [all data]