Stannane,bicyclo[2.2.1]hept-2-en-2-yltrimethyl-

Gas phase ion energetics data

Data compiled by: Sharon G. Lias, Rhoda D. Levin, and Sherif A. Kafafi

Ionization energy determinations

IE (eV) Method Reference Comment
8.45PEHosomi and Traylor, 1975Vertical value

References

Hosomi and Traylor, 1975
Hosomi, A.; Traylor, T.G., Studies of interactions of adjacent carbon-metal σ bonds by photoelectron spectroscopy, J. Am. Chem. Soc., 1975, 97, 3682. [all data]