2-Furanmethanol, 5-methyl-

Van Den Dool and Kratz RI, polar column, temperature ramp

Data compiled by: NIST Mass Spectrometry Data Center, William E. Wallace, director

Column type CapillaryCapillaryCapillary
Active phase DB-WaxCP-Wax 52CBCP-WAX 57CB
Column length (m) 30.50.50.
Carrier gas He He
Substrate
Column diameter (mm) 0.250.320.24
Phase thickness (μm) 0.5
Tstart (C) 40.60.50.
Tend (C) 250.220.210.
Heat rate (K/min) 4.4.2.
Initial hold (min) 5.5.5.
Final hold (min) 15.30.
I 1729.1721.1714.
ReferencePozo-Bayon M.A., Ruiz-Rodriguez A., et al., 2007Mahadevan and Farmer, 2006Baltes and Mevissen, 1988
Comment MSDC-RI MSDC-RI MSDC-RI

References

Pozo-Bayon M.A., Ruiz-Rodriguez A., et al., 2007
Pozo-Bayon M.A.; Ruiz-Rodriguez A.; Pernin K.; Cayot N., Influence of eggs on the aroma composition of a sponge cake and on the aroma release in model studies on flavored sponge cakes, J. Agric. Food Chem., 2007, 55, 4, 1418-1426, https://doi.org/10.1021/jf062203y . [all data]

Mahadevan and Farmer, 2006
Mahadevan, K.; Farmer, L., Key Odor Impact Compounds in Three Yeast Extract Pastes, J. Agric. Food Chem., 2006, 54, 19, 7242-7250, https://doi.org/10.1021/jf061102x . [all data]

Baltes and Mevissen, 1988
Baltes, W.; Mevissen, L., Model reactions on roast aroma formation. VI. Volatile reaction products from the reaction of phenylalanine with glucose during cooking and roasting, Z. Lebensm. Unters. Forsch., 1988, 187, 3, 209-214, https://doi.org/10.1007/BF01043341 . [all data]